ID,"Collection / Source","Catalog Number","Specify Number",Taxon,"Common Name",State,County,Date,Time,Locale,Latitude,Longitude,Collector,"Life Stage","Collection Method","Preparation Type",Count,Temperature,Humidity,"Dew Point",Wind,"Wind Direction","Barometric Pressure",Sky,"Moon Phase",Notes
124880,,2015-015448,,"Argiope aurantia","Black & Yellow Argiope",Kentucky,Daviess,2010-08-28,,"5031 Old Lyddane Bridge Road",37.746807,-87.185997,"Jim Durbin",adult,Blacklight/Fluorescent,Photograph,1,,,,,,,,,
127308,,2015-017898,,"Argiope aurantia","Black & Yellow Argiope",Kentucky,Daviess,2010-08-28,,"5031 Old Lyddane Bridge Road",37.746771,-87.185979,"Jim Durbin",adult,Blacklight/Fluorescent,Photograph,1,,,,,,,,,
127309,,2015-017899,,"Argiope aurantia","Black & Yellow Argiope",Kentucky,Daviess,2010-08-28,,"5031 Old Lyddane Bridge Road",37.746771,-87.185979,"Jim Durbin",adult,Blacklight/Fluorescent,Photograph,1,,,,,,,,,
127310,,2015-017900,,"Argiope aurantia","Black & Yellow Argiope",Kentucky,Daviess,2010-08-28,,"5031 Old Lyddane Bridge Road",37.746771,-87.185979,"Jim Durbin",adult,Blacklight/Fluorescent,Photograph,1,,,,,,,,,
127311,,2015-017901,,"Argiope aurantia","Black & Yellow Argiope",Kentucky,Daviess,2010-08-28,,"5031 Old Lyddane Bridge Road",37.746771,-87.185979,"Jim Durbin",adult,Blacklight/Fluorescent,Photograph,1,,,,,,,,,
127329,,2015-017919,,"Argiope aurantia","Black & Yellow Argiope",Kentucky,Daviess,2010-08-28,,"5031 Old Lyddane Bridge Road",37.746771,-87.185979,"Jim Durbin",adult,Blacklight/Fluorescent,Photograph,1,,,,,,,,,
127330,,2015-017920,,"Argiope aurantia","Black & Yellow Argiope",Kentucky,Daviess,2010-08-28,,"5031 Old Lyddane Bridge Road",37.746771,-87.185979,"Jim Durbin",adult,Blacklight/Fluorescent,Photograph,1,,,,,,,,,
127334,,2015-017924,,"Argiope aurantia","Black & Yellow Argiope",Kentucky,Daviess,2010-08-28,,"5031 Old Lyddane Bridge Road",37.746771,-87.185979,"Jim Durbin",adult,Blacklight/Fluorescent,Photograph,1,,,,,,,,,
127340,,2015-017930,,"Argiope aurantia","Black & Yellow Argiope",Kentucky,Daviess,2010-08-28,,"5031 Old Lyddane Bridge Road",37.746771,-87.185979,"Jim Durbin",adult,Blacklight/Fluorescent,Photograph,1,,,,,,,,,
127341,,2015-017931,,"Argiope aurantia","Black & Yellow Argiope",Kentucky,Daviess,2010-08-28,,"5031 Old Lyddane Bridge Road",37.746771,-87.185979,"Jim Durbin",adult,Blacklight/Fluorescent,Photograph,1,,,,,,,,,
127358,,2015-017948,,"Argiope aurantia","Black & Yellow Argiope",Kentucky,Daviess,2010-08-28,,"5031 Old Lyddane Bridge Road",37.746771,-87.185979,"Jim Durbin",adult,Blacklight/Fluorescent,Photograph,1,,,,,,,,,
137240,,2016-001782,,"Argiope trifasciata","Banded Argiope",Iowa,Cass,2005-09-17,,"Lake Anita State Park",41.426787,-94.77938,"Mark Brown",adult,,Photograph,1,,,,,,,,,
137687,,2016-002231,,"Argiope aurantia","Black & Yellow Argiope",Iowa,Dickinson,2009-09-21,,"Memorial Park, Spirit Lake",43.423989,-95.095714,"Mark Brown",adult,,Photograph,1,,,,,,,,,
147433,,2016-012060,,"Argiope trifasciata","Banded Argiope",Iowa,Winneshiek,2008-09-30,,"Plymouth Rock-x",0,0,"MJ Hatfield",adult,,Photograph,1,,,,,,,,,
147695,,2016-012322,,"Argiope aurantia","Black & Yellow Argiope",Iowa,Plymouth,2014-08-13,,"Heendah Hills State Preserve",42.5949,-96.49129444,"MJ Hatfield",adult,,Photograph,1,,,,,,,,,
176089,,2016-040839,,"Argiope aurantia","Black & Yellow Argiope",Iowa,Linn,2016-08-31,,"Hitaga Sand Ridge Prairie Preserve",42.24944,-91.63056,"Jim Durbin",adult,Blacklight/Fluorescent,Photograph,1,,,,,,,,,
176360,,2016-041110,,"Argiope trifasciata","Banded Argiope",Iowa,Jones,2016-09-04,,"Westphal Timber, Jones",42.1349,-90.95348,"Jim Durbin",adult,Blacklight/Fluorescent,Photograph,1,,,,,,,,,
183366,,2017-001327,,"Argiope aurantia","Black & Yellow Argiope",Iowa,Linn,2016-08-26,,"Hitaga Sand Ridge Prairie Preserve",42.250957,-91.632098,"Jim Durbin",adult,Blacklight/Fluorescent,Photograph,1,,,,,,,,,
185359,,2017-003321,,"Argiope aurantia","Black & Yellow Argiope",Kentucky,Daviess,2007-10-13,,"5031 Old Lyddane Bridge Road",37.746807,-87.185997,"Jim Durbin",adult,Blacklight/Fluorescent,Photograph,1,,,,,,,,,
185377,,2017-003339,,"Argiope aurantia","Black & Yellow Argiope",Kentucky,Daviess,2007-10-13,,"5031 Old Lyddane Bridge Road",37.746807,-87.185997,"Jim Durbin",adult,Blacklight/Fluorescent,Photograph,1,,,,,,,,,
185409,,2017-003371,,"Argiope aurantia","Black & Yellow Argiope",Kentucky,Daviess,2007-10-07,,"5031 Old Lyddane Bridge Road",37.746807,-87.185997,"Jim Durbin",adult,Blacklight/Fluorescent,Photograph,1,,,,,,,,,
185411,,2017-003373,,"Argiope aurantia","Black & Yellow Argiope",Kentucky,Daviess,2007-10-07,,"5031 Old Lyddane Bridge Road",37.746807,-87.185997,"Jim Durbin",adult,Blacklight/Fluorescent,Photograph,1,,,,,,,,,
185613,,2017-003575,,"Argiope aurantia","Black & Yellow Argiope",Iowa,Linn,2007-08-30,,"Grant Wood Trail",42.0275,-91.54722,"Jim Durbin",adult,Blacklight/Fluorescent,Photograph,1,,,,,,,,,
186054,,2017-004016,,"Argiope trifasciata","Banded Argiope",Kentucky,Daviess,2008-09-20,,"5031 Old Lyddane Bridge Road",37.746771,-87.185979,"Jim Durbin",adult,Blacklight/Fluorescent,Photograph,1,,,,,,,,,
186055,,2017-004017,,"Argiope trifasciata","Banded Argiope",Kentucky,Daviess,2008-09-20,,"5031 Old Lyddane Bridge Road",37.746771,-87.185979,"Jim Durbin",adult,Blacklight/Fluorescent,Photograph,1,,,,,,,,,
186059,,2017-004021,,"Argiope aurantia","Black & Yellow Argiope",Kentucky,Daviess,2008-09-20,,"5031 Old Lyddane Bridge Road",37.746771,-87.185979,"Jim Durbin",adult,Blacklight/Fluorescent,Photograph,1,,,,,,,,,
186083,,2017-004045,,"Argiope aurantia","Black & Yellow Argiope",Kentucky,Daviess,2007-10-13,,"5031 Old Lyddane Bridge Road",37.746807,-87.185997,"Jim Durbin",adult,Blacklight/Fluorescent,Photograph,1,,,,,,,,,
220120,,2018-018276,,"Argiope aurantia","Black & Yellow Argiope",Iowa,Sioux,2018-09-05,,"Junction of 370th ST and Hwy 75",43.1136949,-96.173787,"Mark Haan",adult,,Photograph,2,,,,,,,,,
225465,,2019-000401,,"Argiope aurantia","Black & Yellow Argiope",Iowa,Johnson,2018-07-07,,"MacBride Nature Recreation Area",41.786729,-91.568057,"Mark Brown",adult,,Photograph,1,,,,,,,,,
227923,,2019-002645,,"Argiope aurantia","Black & Yellow Argiope",Kentucky,Daviess,2009-08-30,,"5031 Old Lyddane Bridge Road",37.746771,-87.185979,"Jim Durbin",adult,Blacklight/Fluorescent,Photograph,1,,,,,,,,,
227927,,2019-002649,,"Argiope aurantia","Black & Yellow Argiope",Kentucky,Daviess,2009-08-30,,"5031 Old Lyddane Bridge Road",37.746771,-87.185979,"Jim Durbin",adult,Blacklight/Fluorescent,Photograph,1,,,,,,,,,
227929,,2019-002651,,"Argiope aurantia","Black & Yellow Argiope",Kentucky,Daviess,2009-08-30,,"5031 Old Lyddane Bridge Road",37.746771,-87.185979,"Jim Durbin",adult,Blacklight/Fluorescent,Photograph,1,,,,,,,,,
228002,,2019-002724,,"Argiope aurantia","Black & Yellow Argiope",Georgia,Glynn,2009-10-16,,"Jekyll Island",31.03194,-81.4175,"Jim Durbin",adult,Blacklight/Fluorescent,Photograph,1,,,,,,,,,
229377,,2019-004090,,"Argiope aurantia","Black & Yellow Argiope",Iowa,Story,2008-08-05,,"Ada Hayden Heritage Park",42.06694,-93.62944,"Wolfgang Oesterreich",adult,,Photograph,1,,,,,,,,,
229385,,2019-004098,,"Argiope trifasciata","Banded Argiope",Iowa,Story,2016-08-06,,"Ada Hayden Heritage Park",42.06694,-93.62944,"Wolfgang Oesterreich",adult,,Photograph,1,,,,,,,,,
238602,,,,"Argiope trifasciata","Banded Argiope",Iowa,Scott,2019-10-01,14:09:09,"Vander Veer Botanical Park",41.54432605,-90.57619665,"Connie gowan",adult,Sighting,Photograph,1,,,,,,,,,
266086,,,,"Argiope florida",None,Florida,Monroe,2009-02-03,14:06:05,"Crane Point",24.71813732,-81.07521271,"Jim Durbin",adult,Sighting,Photograph,1,,,,,,,,,
282244,,,,"Argiope aurantia","Black & Yellow Argiope",Iowa,Wapello,2020-08-04,,"Eddyville Sand Prairie Park",41.155613,-92.617153,"Mark Brown",adult,Sighting,Photograph,1,,,,,,,,,
282364,,,,"Argiope trifasciata","Banded Argiope",Iowa,Iowa,2020-09-13,,"Amana Lilly Pond",41.801998,-91.881952,"Mark Brown",adult,Sighting,Photograph,1,,,,,,,,,
282372,,,,"Argiope aurantia","Black & Yellow Argiope",Iowa,Wapello,2020-09-20,,"Eddyville Sand Prairie Park",41.155268,-92.617081,"Mark Brown",adult,Sighting,Photograph,1,,,,,,,,,
296588,,,,"Argiope aurantia","Black & Yellow Argiope",Iowa,Johnson,2021-08-21,7:46:28,"MacBride Nature Recreation Area",41.78675752,-91.56846026,"Mark Brown",adult,Sighting,Photograph,1,,,,,,,,,
298099,,,,"Argiope trifasciata","Banded Argiope",Iowa,Polk,2021-10-02,13:14:37,"Slip Bluff County Park",41.59438398,-93.57280109,"Mark Brown",adult,Sighting,Photograph,1,,,,,,,,,
301335,,,,"Argiope trifasciata","Banded Argiope",Iowa,"Cerro Gordo",2021-09-04,,"Wilkinson County Park",43.203277,-93.080456,"Jay Gilliam",adult,Sighting,Photograph,1,,,,,,,,,"Wilkinson Pioneer Park
"
301373,,,,"Argiope aurantia","Black & Yellow Argiope",Iowa,Decatur,2021-10-02,,"Slip Bluff County Park",40.652884,-93.847544,"Jay Gilliam",adult,Sighting,Photograph,1,,,,,,,,,"Slip Bluff County Park
"
319941,,,,"Argiope aurantia","Black & Yellow Argiope",Iowa,Marion,2022-09-17,,"Roberts Creek Park",41.42076,-93.052121,"Jay Gilliam",adult,Sighting,Photograph,1,,,,,,,,,
319974,,,,"Argiope trifasciata","Banded Argiope",Iowa,Marion,2022-10-01,,"Roberts Creek Park",41.42076,-93.052121,"Jay Gilliam",adult,Sighting,Photograph,1,,,,,,,,,
332487,,,,"Argiope trifasciata","Banded Argiope",Iowa,Mahaska,2022-09-24,15:31:11,"Eddyville Cemetery Wetland",41.16761936,-92.63245164166666,"Mark Brown",adult,Sighting,Photograph,1,,,,,,,,,
332809,,,,"Argiope aurantia","Black & Yellow Argiope",Iowa,Johnson,2022-08-27,12:58:01,"Ciha Fen Wildlife Preserve",41.829116255,-91.38159238833333,"Mark Brown",adult,Sighting,Photograph,1,,,,,,,,,
333735,,,,"Argiope aurantia","Black & Yellow Argiope",Iowa,Dallas,2021-08-30,,"Dallas Center",41.687967,-93.965912,"Milo Andrle",adult,Sighting,Photograph,1,,,,,,,,,
341608,,,,"Argiope trifasciata","Banded Argiope",Iowa,Johnson,2023-10-04,15:38:39,"Terry Trueblood Recreation Area",41.624937,-91.52783,"Mark Madsen",adult,Sighting,Photograph,1,,,,,,,,,
344946,,,,"Argiope aurantia","Black & Yellow Argiope",Iowa,Marion,2023-09-23,,"Roberts Creek Park",41.42076,-93.052121,"Jay Gilliam",adult,Sighting,Photograph,1,,,,,,,,,
344991,,,,"Argiope trifasciata","Banded Argiope",Iowa,Decatur,2023-10-01,,"Slip Bluff County Park",40.652884,-93.847544,"Jay Gilliam",adult,Sighting,Photograph,1,,,,,,,,,
349166,,,,"Argiope aurantia","Black & Yellow Argiope",Iowa,Johnson,2013-08-21,,"Willow Creek/Kiwanis Park",41.643084,-91.568489,"Peter Hansen",adult,Sighting,Photograph,1,,,,,,,,,"Kiwanis Park, Iowa City"
