ID,"Collection / Source","Catalog Number","Specify Number",Taxon,"Common Name",State,County,Date,Time,Locale,Latitude,Longitude,Collector,"Life Stage","Collection Method","Preparation Type",Count,Temperature,Humidity,"Dew Point",Wind,"Wind Direction","Barometric Pressure",Sky,"Moon Phase",Notes
6279,,2014-006560,,"Vanessa cardui","Painted Lady",Iowa,Bremer,1950-09-10,,"Bremer County",42.761082,-92.381363," USGS - NPWRC",adult,Sighting,Sighting,1,,,,,,,,,"HIstorical Record"
63991,,2014-064592,,"Vanessa cardui","Painted Lady",Iowa,Bremer,2005-08-12,,"Hay-Buhr Wetland",42.77217,-92.17733,"Dennis Schlicht",adult,Sighting,Sighting,13,,,,,,,,,
63992,,2014-064593,,"Vanessa cardui","Painted Lady",Iowa,Bremer,2005-08-04,,"Hay-Buhr Wetland",42.77217,-92.17733,"Dennis Schlicht",adult,Sighting,Sighting,2,,,,,,,,,
63993,,2014-064594,,"Vanessa cardui","Painted Lady",Iowa,Bremer,2005-07-22,,"Hay-Buhr Wetland",42.77217,-92.17733,"Dennis Schlicht",adult,Sighting,Sighting,1,,,,,,,,,
63994,,2014-064595,,"Vanessa cardui","Painted Lady",Iowa,Bremer,2005-09-02,,"Hay-Buhr Wetland",42.77217,-92.17733,"Frank Olsen",adult,Sighting,Sighting,2,,,,,,,,,
330932,,,,"Vanessa cardui","Painted Lady",Iowa,Bremer,2022-06-27,,"Sweet Marsh State Wildlife Management Area",42.829844,-92.238695,IBSN,adult,Sighting,Sighting,1,70,,,Calm,,,Clear,,
362510,,,,"Vanessa cardui","Painted Lady",Iowa,Bremer,2023-07-10,,"Rolling Prairie Trail",42.700372,-92.313847,IBSN,adult,Sighting,Sighting,1,,,,Calm,,,Clear,,
362512,,,,"Vanessa cardui","Painted Lady",Iowa,Bremer,2023-07-17,,"Rolling Prairie Trail",42.700372,-92.313847,IBSN,adult,Sighting,Sighting,1,,,,"Relatively Still",,,Clear,,
