ID,"Collection / Source","Catalog Number","Specify Number",Taxon,"Common Name",State,County,Date,Time,Locale,Latitude,Longitude,Collector,"Life Stage","Collection Method","Preparation Type",Count,Temperature,Humidity,"Dew Point",Wind,"Wind Direction","Barometric Pressure",Sky,"Moon Phase",Notes
21,"Frank Olsen Drawer 13",2014-000021,SPM010382,"Campaea perlata","Pale Beauty",Iowa,Buchanan,2007-08-17,,"Jakway Forest Park",42.59283,-91.73217,"Frank Olsen",adult,,Pinned,1,,,,,,,,,"Located at Iowa State"
59,,2014-000059,SPM010417,"Timandra amaturaria","Cross-lined Waved",Iowa,Buchanan,2007-08-17,,"Jakway Forest Park",42.59283,-91.73217,"Frank Olsen",adult,,Photograph,1,,,,,,,,,
112,"Frank Olsen Drawer 30",2014-000112,SPM010465,"Alypia octomaculata","Eight-spotted Forester Moth",Iowa,Buchanan,2007-05-31,,"Bearbower Sand Prairie",42.29944,-91.92722,"Frank Olsen",adult,,Pinned,1,,,,,,,,,"Located at Iowa State"
114,"Frank Olsen Drawer 35",2014-000114,SPM010467,"Papaipema arctivorens","Northern Burdock Borer Moth",Iowa,Buchanan,2007-08-17,,"Jakway Forest Park",42.59283,-91.73217,"Frank Olsen",adult,,Pinned,1,,,,,,,,,"Located at Iowa State"
119,"Frank Olsen Drawer 35",2014-000119,SPM010470,"Papaipema rigida","Rigid Sunflower Borer Moth",Iowa,Buchanan,2007-08-17,,"Jakway Forest Park",42.59283,-91.73217,"Frank Olsen",adult,,Pinned,1,,,,,,,,,"Located at Iowa State"
120,"Frank Olsen Drawer 35",2014-000120,SPM010471,"Papaipema rigida","Rigid Sunflower Borer Moth",Iowa,Buchanan,2007-08-17,,"Jakway Forest Park",42.59283,-91.73217,"Frank Olsen",adult,,Pinned,1,,,,,,,,,"Located at Iowa State"
121,"Frank Olsen Drawer 35",2014-000121,SPM010472,"Papaipema rigida","Rigid Sunflower Borer Moth",Iowa,Buchanan,2007-08-17,,"Jakway Forest Park",42.59283,-91.73217,"Frank Olsen",adult,,Pinned,1,,,,,,,,,"Located at Iowa State"
122,,2014-000122,SPM010473,"Papaipema rigida","Rigid Sunflower Borer Moth",Iowa,Buchanan,2007-08-17,,"Jakway Forest Park",42.59283,-91.73217,"Frank Olsen",adult,,Sighting,1,,,,,,,,,
124,"Frank Olsen Drawer 35",2014-000124,SPM010475,"Hydraecia immanis","Hop Vine Borer Moth",Iowa,Buchanan,2007-08-17,,"Jakway Forest Park",42.59283,-91.73217,"Frank Olsen",adult,,Pinned,1,,,,,,,,,"Located at Iowa State"
126,,2014-000126,SPM010477,"Habrosyne gloriosa","Glorius Habrosyne Moth",Iowa,Buchanan,2007-08-17,,"Jakway Forest Park",42.59283,-91.73217,"Frank Olsen",adult,,Photograph,1,,,,,,,,,"Located at Iowa State"
136,"Frank Olsen Drawer 19",2014-000136,SPM010486,"Anavitrinella pampinaria","Common Gray",Iowa,Buchanan,2007-04-23,,"Rowley Fen",42.376101,-91.852143,"Frank Olsen",adult,,Pinned,1,,,,,,,,,"Located at Iowa State"
137,"Frank Olsen Drawer 11",2014-000137,SPM010487,"Iridopsis humaria","Small Purplish Gray",Iowa,Buchanan,2007-04-23,,"Rowley Fen",42.375879,-91.852186,"Frank Olsen",adult,,Pinned,1,,,,,,,,,"Located at Iowa State"
145,"Frank Olsen Drawer 19",2014-000145,SPM010494,"Anavitrinella pampinaria","Common Gray",Iowa,Buchanan,2007-08-17,,"Jakway Forest Park",42.59283,-91.73217,"Frank Olsen",adult,,Pinned,1,,,,,,,,,"Located at Iowa State"
220,"Frank Olsen Drawer 07",2014-000220,SPM010562,"Agrotis ipsilon","Ipsilion Dart",Iowa,Buchanan,2007-04-23,,"Rowley Fen",42.375974,-91.852315,"Frank Olsen",adult,,Pinned,1,,,,,,,,,"Located at Iowa State"
221,"Frank Olsen Drawer 07",2014-000221,SPM010563,"Feltia jaculifera","Dingy Cutworm Moth",Iowa,Buchanan,2007-08-17,,"Jakway Forest Park",42.59283,-91.73217,"Frank Olsen",adult,,Pinned,1,,,,,,,,,"Located at Iowa State"
230,"Frank Olsen Drawer 09",2014-000230,SPM010570,"Peridroma saucia","Variegated Cutworm Moth",Iowa,Buchanan,2007-04-23,,"Rowley Fen",42.376037,-91.8521,"Frank Olsen",adult,,Pinned,1,,,,,,,,,"Located at Iowa State"
231,"Frank Olsen Drawer 09",2014-000231,SPM010571,"Peridroma saucia","Variegated Cutworm Moth",Iowa,Buchanan,2007-04-23,,"Rowley Fen",42.376227,-91.851971,"Frank Olsen",adult,,Pinned,1,,,,,,,,,"Located at Iowa State"
240,"Frank Olsen Drawer 10",2014-000240,SPM010579,"Atteva aurea","Ailanthus Webworm Moth",Iowa,Buchanan,2007-04-23,,"Rowley Fen",42.376291,-91.852272,"Frank Olsen",adult,,Pinned,1,,,,,,,,,"Located at Iowa State"
277,"Frank Olsen Drawer 45",2014-000277,SPM010614,"Hypagyrtis unipunctata","One-Spotted Variant",Iowa,Buchanan,2007-08-17,,"Jakway Forest Park",42.59283,-91.73217,"Frank Olsen",adult,,Pinned,1,,,,,,,,,"Located at Iowa State"
300,"Frank Olsen Drawer 44",2014-000300,SPM010635,"Xanthorhoe ferrugata","Red Twin-spot",Iowa,Buchanan,2007-08-17,,"Jakway Forest Park",42.59283,-91.73217,"Frank Olsen",adult,,Pinned,1,,,,,,,,,"Located at Iowa State"
309,"Frank Olsen Drawer 43",2014-000309,SPM010643,"Orthonama obstipata","The Gem",Iowa,Buchanan,2007-04-23,,"Rowley Fen",42.376259,-91.851628,"Frank Olsen",adult,,Pinned,1,,,,,,,,,"Located at Iowa State"
329,"Frank Olsen Drawer 43",2014-000329,SPM010661,"Clemensia albata","Little White Lichen Moth",Iowa,Buchanan,2007-08-17,,"Jakway Forest Park",42.59283,-91.73217,"Frank Olsen",adult,,Pinned,1,,,,,,,,,"Located at Iowa State"
374,,2014-000374,SPM010701,"Pseudeustrotia carneola","Pink-barred Pseudeustrotia",Iowa,Buchanan,2007-05-31,,"Bearbower Sand Prairie",42.29944,-91.92722,"Frank Olsen",adult,,Sighting,1,,,,,,,,,
461,"Frank Olsen Drawer 35",2014-000461,SPM010784,"Hydraecia micacea","Rosy Rustic Moth",Iowa,Buchanan,2007-08-17,,"Jakway Forest Park",42.59283,-91.73217,"Frank Olsen",adult,,Pinned,1,,,,,,,,,"Located at Iowa State"
472,"Frank Olsen Drawer 02",2014-000472,SPM010794,"Copivaleria grotei","Grote's Sallow",Iowa,Buchanan,2007-04-23,,"Rowley Fen",42.376265,-91.8521,"Frank Olsen",adult,,Pinned,1,,,,,,,,,"Located at Iowa State"
474,"Jim Durbin Drawer 161",2014-000474,SPM010796,"Mythimna unipuncta","Armyworm Moth",Iowa,Buchanan,2007-04-23,,"Rowley Fen",42.375974,-91.852186,"Frank Olsen",adult,Blacklight/Florescent,Pinned,1,,,,,,,,,
475,"Frank Olsen Drawer 01",2014-000475,SPM010797,"Mythimna unipuncta","Armyworm Moth",Iowa,Buchanan,2007-04-23,,"Rowley Fen",42.376202,-91.8521,"Frank Olsen",adult,,Pinned,1,,,,,,,,,"Located at Iowa State"
476,"Frank Olsen Drawer 01",2014-000476,SPM010798,"Mythimna unipuncta","Armyworm Moth",Iowa,Buchanan,2007-04-23,,"Rowley Fen",42.376044,-91.852357,"Frank Olsen",adult,,Pinned,1,,,,,,,,,"Located at Iowa State"
484,"Frank Olsen Drawer 06",2014-000484,SPM010805,"Orthosia hibisci","Speckled Green Fruitworm Moth",Iowa,Buchanan,2007-04-23,,"Rowley Fen",42.376393,-91.852443,"Frank Olsen",adult,,Pinned,1,,,,,,,,,"Located at Iowa State"
486,"Frank Olsen Drawer 01",2014-000486,SPM010807,"Leucania multilinea","Many-Lined Wainscot",Iowa,Buchanan,2007-08-17,,"Jakway Forest Park",42.59283,-91.73217,"Frank Olsen",adult,,Pinned,1,,,,,,,,,"Located at Iowa State"
494,"Frank Olsen Drawer 08",2014-000494,SPM010814,"Xestia smithii","Smith's Dart Moth",Iowa,Buchanan,2007-08-17,,"Jakway Forest Park",42.59283,-91.73217,"Frank Olsen",adult,,Pinned,1,,,,,,,,,"Located at Iowa State"
1021,"Frank Olsen Drawer 13",2014-001021,SPM010382,"Campaea perlata","Pale Beauty",Iowa,Buchanan,2007-08-17,,"Jakway Forest Park",42.59283,-91.73217,"Frank Olsen",adult,,Pinned,1,,,,,,,,,"Located at Iowa State"
1059,"Frank Olsen Drawer 44",2014-001059,SPM010417,"Timandra amaturaria","Cross-lined Waved",Iowa,Buchanan,2007-08-17,,"Jakway Forest Park",42.59283,-91.73217,"Frank Olsen",adult,,Pinned,1,,,,,,,,,"Located at Iowa State"
1516,,2014-001537,SPM041818,"Callosamia promethea","Promethea Moth",Iowa,Buchanan,2011-01-29,,"Crumbacher Wildlife Area",42.4391667,-91.9816667,"Tom Jantscher",pupa,,Sighting,1,,,,,,,,,
1546,,2014-001575,SPM041856,"Callosamia promethea","Promethea Moth",Iowa,Buchanan,2011-06-06,,"Crumbacher Wildlife Area",42.4391667,-91.9816667,"Tom Jantscher",adult,,Sighting,1,,,,,,,,,
13067,,2014-013349,SPM020909,"Acrolophus arcanella","Grass Tubeworm Moth",Iowa,Buchanan,2010-09-17,,"Jakway Forest Park",42.59283,-91.73217,"Frank Olsen",adult,,Photograph,1,,,,,,,,,
14621,,2014-014909,SPM021034,"Alypia octomaculata","Eight-spotted Forester Moth",Iowa,Buchanan,2010-05-22,,"Buffalo Creek Wildlife Area, North",42.398604,-91.643,"Tom Jantscher",adult,,Sighting,1,,,,,,,,,
14623,"Frank Olsen Drawer 30",2014-014911,SPM024595,"Alypia octomaculata","Eight-spotted Forester Moth",Iowa,Buchanan,2011-06-24,,"Rowley Fen",42.37694,-91.85194,"Frank Olsen",adult,,Pinned,1,,,,,,,,,"Located at Iowa State"
17943,,2014-018243,SPM002317,"Cabera variolaria","Vestal Moth",Iowa,Buchanan,1985-05-17,,"Bearbower Sand Prairie",42.29944,-91.92722,"Dennis Schlicht",adult,,Pinned,1,,,,,,,,,
17978,"Frank Olsen Drawer 39",2014-018278,SPM025179,"Caenurgina crassiuscula","Clover Looper Moth",Iowa,Buchanan,2011-05-12,,"Rowley Fen",42.37694,-91.85194,"Frank Olsen",adult,,Pinned,1,,,,,,,,,"Located at Iowa State"
18260,,2014-018560,SPM021055,"Callosamia promethea","Promethea Moth",Iowa,Buchanan,2011-02-08,,"Buchanan County",42.47833,-91.82556,"Tom Jantscher",adult,,Pinned,1,,,,,,,,,
18273,,2014-018573,SPM024636,"Callosamia promethea","Promethea Moth",Iowa,Buchanan,2011-01-29,,"Crumbacher Wildlife Area",42.43917,-91.98167,"Tom Jantscher",adult,,Sighting,1,,,,,,,,,
21837,"Frank Olsen Drawer 34",2014-022174,SPM024601,"Condica videns","White-dotted Groundling",Iowa,Buchanan,2011-05-12,,"Rowley Fen",42.37694,-91.85194,"Frank Olsen",adult,,Pinned,1,,,,,,,,,"Located at Iowa State"
23828,"Frank Olsen Drawer 45",2014-024174,SPM025144,"Digrammia gnophosaria","Hollow-spotted Angle",Iowa,Buchanan,2011-05-12,,"Rowley Fen",42.37694,-91.85194,"Frank Olsen",adult,,Pinned,1,,,,,,,,,"Located at Iowa State"
24854,"Frank Olsen Drawer 48",2014-025201,SPM020838,"Elophila obliteralis","Waterlily Leafcutter Moth",Iowa,Buchanan,2010-09-17,,"Jakway Forest Park",42.59283,-91.73217,"Frank Olsen",adult,,Pinned,1,,,,,,,,,"Located at Iowa State"
25492,,2014-025839,SPM013326,"Eucosma ochroterminana","Buff-tipped Phaneta Moth",Iowa,Buchanan,2008-08-20,,"Rowley Fen",42.375822,-91.8521,"Frank Olsen",adult,,Pinned,1,,,,,,,,,"Located at Iowa State"
25613,"Frank Olsen Drawer 49",2014-025960,SPM013328,"Epiblema strenuana","Ragweed Borer Moth",Iowa,Buchanan,2008-08-20,,"Rowley Fen",42.376006,-91.8524,"Frank Olsen",adult,,Pinned,1,,,,,,,,,"Located at Iowa State"
29037,"Frank Olsen Drawer 52",2014-029390,SPM002393,"Haploa confusa","Confused Haploa Moth",Iowa,Buchanan,2003-07-12,,"Bearbower Sand Prairie",42.29944,-91.92722,"Frank Olsen",adult,,Pinned,1,,,,,,,,,"Located at Iowa State"
29101,"Frank Olsen Drawer 52",2014-029454,SPM007421,"Haploa lecontei","Leconte's Haploa Moth",Iowa,Buchanan,2006-06-02,,"Bearbower Sand Prairie",42.29944,-91.92722,"Frank Olsen",adult,,Pinned,1,,,,,,,,,"Located at Iowa State"
29668,,2014-030021,SPM021190,"Hemaris diffinis","Snowberry Clearwing Moth",Iowa,Buchanan,2010-07-17,,"Bearbower Sand Prairie",42.29944,-91.92722,"Tom Jantscher",adult,,Photograph,1,,,,,,,,,
33799,"Frank Olsen Drawer 01",2014-034171,SPM012982,"Leucania linda","Linda Wainscot Moth",Iowa,Buchanan,2008-08-20,,"Rowley Fen",42.376171,-91.852315,"Frank Olsen",adult,,Pinned,1,,,,,,,,,"Located at Iowa State"
33836,"Frank Olsen Drawer 01",2014-034208,SPM012985,"Leucania multilinea","Many-Lined Wainscot",Iowa,Buchanan,2008-08-20,,"Rowley Fen",42.376107,-91.852272,"Frank Olsen",adult,,Pinned,1,,,,,,,,,"Located at Iowa State"
33837,"Frank Olsen Drawer 01",2014-034209,SPM012986,"Leucania lapidaria",None,Iowa,Buchanan,2008-08-20,,"Rowley Fen",42.376202,-91.852014,"Frank Olsen",adult,,Pinned,1,,,,,,,,,"Located at Iowa State"
34580,"Frank Olsen Drawer 45",2014-034953,SPM002316,"Lomographa vestaliata","White Spring Moth",Iowa,Buchanan,1985-05-17,,"Bearbower Sand Prairie",42.29944,-91.92722,"Dennis Schlicht",adult,,Pinned,1,,,,,,,,,"Located at Iowa State"
38125,"Frank Olsen Drawer 09",2014-038499,SPM012827,"Ochropleura implecta","Flame-Shouldered Dart",Iowa,Buchanan,2008-05-31,,"Bearbower Sand Prairie",42.29944,-91.92722,"Frank Olsen",adult,,Pinned,1,,,,,,,,,"Located at Iowa State"
38181,"Frank Olsen Drawer 05",2014-038555,SPM013371,"Ogdoconta cinereola","Common Pinkband",Iowa,Buchanan,2008-08-20,,"Rowley Fen",42.376139,-91.852143,"Frank Olsen",adult,,Pinned,1,,,,,,,,,"Located at Iowa State"
39200,,2014-039574,SPM012918,"Ostrinia nubilalis","European Corn Borer Moth",Iowa,Buchanan,2008-08-20,,"Rowley Fen",42.376234,-91.8521,"Frank Olsen",adult,,Photograph,1,,,,,,,,,
39201,,2014-039575,SPM012919,"Ostrinia nubilalis","European Corn Borer Moth",Iowa,Buchanan,2008-08-20,,"Rowley Fen",42.376234,-91.852186,"Frank Olsen",adult,,Photograph,1,,,,,,,,,
39202,,2014-039576,SPM012920,"Ostrinia nubilalis","European Corn Borer Moth",Iowa,Buchanan,2008-08-20,,"Rowley Fen",42.376012,-91.8521,"Frank Olsen",adult,,Sighting,1,,,,,,,,,
40250,"Frank Olsen Drawer 35",2014-040627,SPM020236,"Papaipema nebris","Stalk Borer Moth",Iowa,Buchanan,2010-09-17,,"Jakway Forest Park",42.59283,-91.73217,"Frank Olsen",adult,,Pinned,1,,,,,,,,,"Located at Iowa State"
40890,"Frank Olsen Drawer 16",2014-041267,SPM012843,"Pero ancetaria","Hubner's Pero",Iowa,Buchanan,2008-05-31,,"Bearbower Sand Prairie",42.29944,-91.92722,"Frank Olsen",adult,,Pinned,1,,,,,,,,,"Located at Iowa State"
40891,"Frank Olsen Drawer 16",2014-041268,SPM012844,"Pero ancetaria","Hubner's Pero",Iowa,Buchanan,2008-05-31,,"Bearbower Sand Prairie",42.29944,-91.92722,"Frank Olsen",adult,,Pinned,1,,,,,,,,,"Located at Iowa State"
40892,"Frank Olsen Drawer 16",2014-041269,SPM012845,"Pero ancetaria","Hubner's Pero",Iowa,Buchanan,2008-05-31,,"Bearbower Sand Prairie",42.29944,-91.92722,"Frank Olsen",adult,,Pinned,1,,,,,,,,,"Located at Iowa State"
40895,"Frank Olsen Drawer 16",2014-041272,SPM012848,"Pero morrisonaria","Morrison's Pero Moth",Iowa,Buchanan,2008-08-20,,"Rowley Fen",42.376044,-91.852315,"Frank Olsen",adult,,Pinned,1,,,,,,,,,"Located at Iowa State"
40984,"Frank Olsen Drawer 16",2014-041361,SPM024440,"Pero ancetaria","Hubner's Pero",Iowa,Buchanan,2011-05-12,,"Rowley Fen",42.37694,-91.85194,"Frank Olsen",adult,,Pinned,1,,,,,,,,,"Located at Iowa State"
41847,"Jim Durbin Drawer 107",2014-042224,SPM024572,"Phragmatobia fuliginosa","Ruby Tiger Moth",Iowa,Buchanan,2011-05-12,,"Rowley Fen",42.37694,-91.85194,"Frank Olsen",adult,Blacklight/Florescent,Pinned,1,,,,,,,,,
41848,"Frank Olsen Drawer 56",2014-042225,SPM024573,"Phragmatobia fuliginosa","Ruby Tiger Moth",Iowa,Buchanan,2011-05-12,,"Rowley Fen",42.37694,-91.85194,"Frank Olsen",adult,,Pinned,1,,,,,,,,,"Located at Iowa State"
41879,"Frank Olsen Drawer 56",2014-042256,SPM012790,"Phragmatobia fuliginosa","Ruby Tiger Moth",Iowa,Buchanan,2008-08-20,,"Rowley Fen",42.376076,-91.852014,"Frank Olsen",adult,,Pinned,1,,,,,,,,,"Located at Iowa State"
42197,,2014-042574,SPM020245,"Papaipema nebris","Stalk Borer Moth",Iowa,Buchanan,2010-09-17,,"Jakway Forest Park",42.59283,-91.73217,"Frank Olsen",adult,,Photograph,1,,,,,,,,,
42472,,2014-042849,SPM020883,"Emmelina monodactyla","Morning-glory Plume Moth",Iowa,Buchanan,2010-09-17,,"Jakway Forest Park",42.59283,-91.73217,"Frank Olsen",adult,,Pinned,1,,,,,,,,,"Located at Iowa State"
43136,"Frank Olsen Drawer 40",2014-043513,SPM025185,"Ponometia erastrioides","Small Bird-dropping Moth",Iowa,Buchanan,2011-05-12,,"Rowley Fen",42.37694,-91.85194,"Frank Olsen",adult,,Pinned,1,,,,,,,,,"Located at Iowa State"
44017,"Frank Olsen Drawer 41",2014-044394,SPM020553,"Pseudeustrotia carneola","Pink-barred Pseudeustrotia",Iowa,Buchanan,2010-09-17,,"Jakway Forest Park",42.59283,-91.73217,"Frank Olsen",adult,,Pinned,1,,,,,,,,,"Located at Iowa State"
44018,"Frank Olsen Drawer 41",2014-044395,SPM020554,"Pseudeustrotia carneola","Pink-barred Pseudeustrotia",Iowa,Buchanan,2010-09-17,,"Jakway Forest Park",42.59283,-91.73217,"Frank Olsen",adult,,Pinned,1,,,,,,,,,"Located at Iowa State"
44401,"Frank Olsen Drawer 48",2014-044778,SPM025012,"Pyrausta bicoloralis","Bicolored Pyrausta Moth",Iowa,Buchanan,2011-09-19,,"Rowley Fen",42.37694,-91.85194,"Frank Olsen",adult,,Pinned,1,,,,,,,,,"Located at Iowa State"
44595,"Frank Olsen Drawer 51",2014-044972,SPM012693,"Pyrrharctia isabella","Isabella Tiger Moth",Iowa,Buchanan,2008-08-20,,"Rowley Fen",42.376076,-91.852229,"Frank Olsen",adult,,Pinned,1,,,,,,,,,"Located at Iowa State"
44956,"Frank Olsen Drawer 40",2014-045333,SPM024939,"Galgula partita","The Wedgling",Iowa,Buchanan,2011-05-12,,"Rowley Fen",42.37694,-91.85194,"Frank Olsen",adult,,Pinned,1,,,,,,,,,"Located at Iowa State"
45575,"Frank Olsen Drawer 44",2014-045952,SPM013096,"Scopula inductata","Soft-lined Wave",Iowa,Buchanan,2008-08-20,,"Rowley Fen",42.376164,-91.852229,"Frank Olsen",adult,,Pinned,1,,,,,,,,,"Located at Iowa State"
45860,"Frank Olsen Drawer 49",2014-046237,SPM020100,"Semioscopis packardella","Packard's Concealer Moth",Iowa,Buchanan,2007-04-23,,"Rowley Fen",42.375828,-91.852572,"Frank Olsen",adult,,Pinned,1,,,,,,,,,"Located at Iowa State"
45975,"Frank Olsen Drawer 30",2014-046352,SPM024711,"Acronicta insularis","Henry's Marsh Moth",Iowa,Buchanan,2011-05-12,,"Rowley Fen",42.37694,-91.85194,"Frank Olsen",adult,,Pinned,1,,,,,,,,,"Located at Iowa State"
46450,"Frank Olsen Drawer 24",2014-046827,SPM024347,"Sphecodina abbottii","Abbott's Sphinx Moth",Iowa,Buchanan,2011-05-12,,"Rowley Fen",42.37694,-91.85194,"Frank Olsen",adult,,Pinned,1,,,,,,,,,"Located at Iowa State"
47463,"Frank Olsen Drawer 45",2014-047841,SPM020502,"Synchlora aerata","Wavy-Lined Emerald",Iowa,Buchanan,2010-09-17,,"Jakway Forest Park",42.59283,-91.73217,"Frank Olsen",adult,,Pinned,1,,,,,,,,,"Located at Iowa State"
48114,,2014-048492,SPM012991,"Tricholita signata","Dingy Cutworm Moth",Iowa,Buchanan,2008-08-20,,"Rowley Fen",42.376012,-91.852186,"Frank Olsen",adult,,Pinned,1,,,,,,,,,"Located at Iowa State"
48806,"Frank Olsen Drawer 44",2014-049184,SPM024917,"Xanthorhoe ferrugata","Red Twin-spot",Iowa,Buchanan,2011-05-12,,"Rowley Fen",42.37694,-91.85194,"Frank Olsen",adult,,Pinned,1,,,,,,,,,"Located at Iowa State"
49022,"Jim Durbin Drawer 164",2014-049400,SPM015844,"Tricholita signata","Dingy Cutworm Moth",Iowa,Buchanan,2007-08-17,,"Jakway Forest Park",42.59283,-91.73217,"Frank Olsen",adult,Blacklight/Florescent,Pinned,1,,,,,,,,,
71918,"Frank Olsen Drawer 02",2014-072526,,"Dargida diffusa","Wheat Head Armyworm Moth",Iowa,Buchanan,2014-05-20,,"Fairbank Fen",42.636185,-92.001039,"Frank Olsen",adult,,Pinned,1,,,,,,,,,"Located at Iowa State"
120799,"Frank Olsen Drawer 02",2015-011185,,"Copivaleria grotei","Grote's Sallow",Iowa,Buchanan,2007-04-23,,"Rowley Fen",42.3758333,-91.8536111,"Frank Olsen",adult,,Pinned,1,,,,,,,,,"Located at Iowa State"
120827,"Frank Olsen Drawer 01",2015-011213,,"Mythimna unipuncta","Armyworm Moth",Iowa,Buchanan,2007-04-23,,"Rowley Fen",42.3758333,-91.8536111,"Frank Olsen",adult,,Pinned,1,,,,,,,,,"Located at Iowa State"
120837,,2015-011224,,"Leucania lapidaria",None,Iowa,Buchanan,2007-08-17,,"Jakway Forest Park",42.59283,-91.73217,"Frank Olsen",adult,,Pinned,1,,,,,,,,,"Located at Iowa State"
120847,"Frank Olsen Drawer 06",2015-011234,,"Orthosia hibisci","Speckled Green Fruitworm Moth",Iowa,Buchanan,2007-04-23,,"Rowley Fen",42.3758333,-91.8536111,"Frank Olsen",adult,,Pinned,1,,,,,,,,,"Located at Iowa State"
123882,,2015-014449,,"Haematopis grataria","Chickweed Geometer",Iowa,Buchanan,1985-07-28," light winds,","Bearbower Sand Prairie",42.29944,-91.92722,"Frank Olsen",adult,,Sighting,1,85,,,,,,"Pt. sunny",,
124810,,2015-015377,,"Alypia octomaculata","Eight-spotted Forester Moth",Iowa,Buchanan,1990-08-01," light winds,","Blazing Star Prairie, Buchanan",42.35473,-91.806338,"Frank Olsen",adult,,Sighting,1,71,,,,,,"Pt. sunny",,
135397,,2015-025991,,"Argyrotaenia velutinana","Red Banded Leafroller Moth",Iowa,Buchanan,2011-05-12,,"Rowley Fen",42.37694,-91.85194,"Frank Olsen",adult,,Pinned,1,,,,,,,,,"Located at Iowa State"
143724,,2016-008572,,"Haematopis grataria","Chickweed Geometer",Iowa,Buchanan,1985-07-28,,"Bearbower Sand Prairie",42.29944,-91.92722,"Frank Olsen",adult,,Sighting,1,,,,,,,,,
143725,,2016-008573,,"Alypia octomaculata","Eight-spotted Forester Moth",Iowa,Buchanan,2001-06-08,,"Rowley Fen",42.37694,-91.85194,"Frank Olsen",adult,,Sighting,1,,,,,,,,,
188210,,2017-006171,,"Hyles lineata","White-Lined Sphinx Moth",Iowa,Buchanan,2017-05-13,,"Bearbower Sand Prairie",42.29944,-91.92722,"Don F. Becker",adult,,Photograph,1,,,,,,,,,
200592,,2017-018524,,"Hypena scabra","Green Cloverworm Moth",Iowa,Buchanan,2016-09-11,,Rowley,42.36918,-91.84475,"Kenneth Heiar",adult,,Photograph,1,,,,,,,,,
200627,,2017-018559,,"Dryocampa rubicunda","Rosy Maple Moth",Iowa,Buchanan,2016-07-14,,Independence-x,42.465527,-91.887981,"A Sherrets",adult,,Photograph,1,,,,,,,,,
200640,,2017-018572,,"Carmenta ithacae",None,Iowa,Buchanan,2016-06-15,,Independence-x,42.46448,-91.890223,"Sara Sheeley",adult,,Photograph,1,,,,,,,,,
228928,,2019-003654,,"Papaipema nebris","Stalk Borer Moth",Iowa,Buchanan,2010-09-17,,"Jakway Forest Park",42.59283,-91.73217,"Frank Olsen",adult,,Sighting,1,,,,,,,,,
228947,"Frank Olsen Drawer 07",2019-003661,,"Feltia herilis","Master's Dart",Iowa,Buchanan,2007-08-17,,"Jakway Forest Park",42.59283,-91.73217,"Frank Olsen",adult,,Pinned,1,,,,,,,,,"Located at Iowa State"
237586,,,,"Desmia funeralis-maculalis",None,Iowa,Buchanan,2017-06-30,9:43:02,"Bearbower Sand Prairie",42.297956,-91.926227,"Kenneth Heiar",adult,Sighting,Photograph,1,,,,,,,,,"Sighted at Bearbower Sand Prairie."
241722,"Frank Olsen Drawer 10",2019-010004,,"Acrolophus mora",None,Iowa,Buchanan,2010-09-17,,"Jakway Forest Park",42.59283,-91.73217,"Frank Olsen",,Blacklight/Fluorescent,Pinned,1,,,,,,,,,"Located at Iowa State"
241724,"Frank Olsen Drawer 10",2019-010006,,"Atteva aurea","Ailanthus Webworm Moth",Iowa,Buchanan,2007-04-23,,"Rowley Fen",42.37694,-91.85194,"Frank Olsen",,Blacklight/Fluorescent,Pinned,1,,,,,,,,,"Located at Iowa State"
247965,"Jim Durbin Drawer 054",2020-000037,,"Anavitrinella pampinaria","Common Gray",Iowa,Buchanan,2007-04-23,,"Rowley Fen",42.376301,-91.852186,"Frank Olsen",adult,Blacklight/Florescent,Pinned,1,,,,,,,,,
264233,,,,"Hemaris diffinis","Snowberry Clearwing Moth",Iowa,Buchanan,2018-06-27,,"Rowley Fen",42.37694,-91.85194,"Frank Olsen",adult,Sighting,Sighting,2,,,,,,,,,"1330-1425, 50-60% sun, 79-81, 0-4"
274695,"Frank Olsen Drawer 49",2020-000712,,"Eucosma raracana","Reddish Phaneta Moth",Iowa,Buchanan,2008-08-20,,"Rowley Fen",42.375025,-91.852297,"Frank Olsen",adult,,Pinned,1,,,,,,,,,"Located at Iowa State"
274842,"Frank Olsen Drawer 41",2020-000745,,"Ponometia binocula","Prairie Bird-dropping Moth",Iowa,Buchanan,2007-05-31,,"Rowley Fen",42.37694,-91.85194,"Frank Olsen",adult,Sighting,Pinned,1,,,,,,,,,"Located at Iowa State"
302415,"Jim Durbin Drawer 150",2021-000607,,"Papaipema nebris","Stalk Borer Moth",Iowa,Buchanan,2010-09-17,,"Jakway Forest Park",42.590581,-91.729817,"Frank Olsen",adult,Blacklight/Florescent,Pinned,1,,,,,,,,,
317557,,,SPM020100,"Olethreutes tilianum","Basswood Olethreutes Moth",Iowa,Buchanan,2007-04-23,,"Rowley Fen",42.375828,-91.852572,"Frank Olsen",adult,,Pinned,1,,,,,,,,,"Located at Iowa State"
335676,,,,"Depressaria radiella","Parsnip Webworm Moth",Iowa,Buchanan,2023-06-22,11:16:13,"Bearbower Sand Prairie",42.298269,-91.925966,"Kenneth Heiar",adult,Sighting,Photograph,1,,,,,,,,,
339237,,,,"Drepana arcuata","Arched Hooktip",Iowa,Buchanan,2023-08-05,23:25:41,"Junction of 260th ST and Michel Ave",42.417677777777776,-91.82303333333333,"Dalton Bantz",adult,Sighting,Photograph,1,,,,,,,,,
348448,,,,"Gillmeria pallidactyla",None,Iowa,Buchanan,2023-05-21,11:23:28,"Bearbower Sand Prairie",42.301489,-91.929676,"Kenneth Heiar",adult,Sighting,Photograph,1,,,,,,,,,
349492,,,,"Celypha cespitana","Celypha Moth",Iowa,Buchanan,2023-06-15,,"Kounty Pond - Hoffman Woods Area",42.309019,-91.953616,"MJ Hatfield",adult,Sighting,Photograph,1,,,,,,,,,
349547,,,,"Synchlora aerata","Wavy-Lined Emerald",Iowa,Buchanan,2016-09-11,12:47:13,"Bearbower Sand Prairie",42.299257,-91.926226,"Kenneth Heiar",larva,Sighting,Photograph,1,,,,,,,,,