ID,"Collection / Source","Catalog Number","Specify Number",Taxon,"Common Name",State,County,Date,Time,Locale,Latitude,Longitude,Collector,"Life Stage","Collection Method","Preparation Type",Count,Temperature,Humidity,"Dew Point",Wind,"Wind Direction","Barometric Pressure",Sky,"Moon Phase",Notes
7,"Frank Olsen Drawer 17",2014-000007,SPM010369,"Desmia funeralis-maculalis",None,Iowa,Clarke,2007-06-02,,"Red Fern Timber",40.98317,-93.75317,"Frank Olsen",adult,,Pinned,1,,,,,,,,,"Located at Iowa State"
69,"Frank Olsen Drawer 22",2014-000069,SPM010426,"Eubaphe mendica","The Beggar",Iowa,Clarke,2007-06-02,,"Red Fern Timber",40.98317,-93.75317,"Frank Olsen",adult,,Pinned,1,,,,,,,,,"Located at Iowa State"
80,"Frank Olsen Drawer 53",2014-000080,SPM010436,"Nadata gibbosa","White-dotted Prominent Moth",Iowa,Clarke,2007-06-02,,"Red Fern Timber",40.98317,-93.75317,"Frank Olsen",adult,,Pinned,1,,,,,,,,,"Located at Iowa State"
83,"Frank Olsen Drawer 52",2014-000083,SPM010438,"Haploa lecontei","Leconte's Haploa Moth",Iowa,Clarke,2007-06-02,,"Red Fern Timber",40.98317,-93.75317,"Frank Olsen",adult,,Pinned,1,,,,,,,,,"Located at Iowa State"
88,"Frank Olsen Drawer 51",2014-000088,SPM010443,"Pyrrharctia isabella","Isabella Tiger Moth",Iowa,Clarke,2007-06-02,,"Red Fern Timber",40.98317,-93.75317,"Frank Olsen",adult,,Pinned,1,,,,,,,,,"Located at Iowa State"
103,"Frank Olsen Drawer 39",2014-000103,SPM010457,"Argyrostrotis anilis","Short-lined Chocolate",Iowa,Clarke,2007-06-02,,"Red Fern Timber",40.98317,-93.75317,"Frank Olsen",adult,,Pinned,1,,,,,,,,,"Located at Iowa State"
125,"Frank Olsen Drawer 08",2014-000125,SPM010476,"Noctua pronuba","Large Yellow Underwing",Iowa,Clarke,2007-06-02,,"Red Fern Timber",40.98317,-93.75317,"Frank Olsen",adult,,Pinned,1,,,,,,,,,"Located at Iowa State"
129,"Frank Olsen Drawer 11",2014-000129,SPM010479,"Macaria multilineata","Many-lined Angle",Iowa,Clarke,2007-06-02,,"Red Fern Timber",40.98317,-93.75317,"Frank Olsen",adult,,Pinned,1,,,,,,,,,"Located at Iowa State"
162,"Frank Olsen Drawer 14",2014-000162,SPM010509,"Hypagyrtis unipunctata","One-Spotted Variant",Iowa,Clarke,2007-06-02,,"Red Fern Timber",40.98317,-93.75317,"Frank Olsen",adult,,Pinned,1,,,,,,,,,"Located at Iowa State"
195,"Frank Olsen Drawer 59",2014-000195,SPM010539,"Panopoda carneicosta","Brown Panopoda Moth",Iowa,Clarke,2007-06-02,,"Red Fern Timber",40.98317,-93.75317,"Frank Olsen",adult,,Pinned,1,,,,,,,,,"Located at Iowa State"
196,"Frank Olsen Drawer 59",2014-000196,SPM010540,"Panopoda carneicosta","Brown Panopoda Moth",Iowa,Clarke,2007-06-02,,"Red Fern Timber",40.98317,-93.75317,"Frank Olsen",adult,,Pinned,1,,,,,,,,,"Located at Iowa State"
197,,2014-000197,SPM010541,"Panopoda carneicosta","Brown Panopoda Moth",Iowa,Clarke,2007-06-02,,"Red Fern Timber",40.98317,-93.75317,"Frank Olsen",adult,,Pinned,1,,,,,,,,,"to verify"
229,"Frank Olsen Drawer 09",2014-000229,SPM010569,"Peridroma saucia","Variegated Cutworm Moth",Iowa,Clarke,2007-06-02,,"Red Fern Timber",40.98317,-93.75317,"Frank Olsen",adult,,Pinned,1,,,,,,,,,"Located at Iowa State"
244,"Frank Olsen Drawer 45",2014-000244,SPM010583,"Packardia geminata","Jeweled Tailed Slug Moth",Iowa,Clarke,2007-06-02,,"Red Fern Timber",40.98317,-93.75317,"Frank Olsen",adult,,Pinned,1,,,,,,,,,"Located at Iowa State"
245,"Frank Olsen Drawer 45",2014-000245,SPM010584,"Lithacodes fasciola","Yellow-shouldered Slug Moth",Iowa,Clarke,2007-06-02,,"Red Fern Timber",40.98317,-93.75317,"Frank Olsen",adult,,Pinned,1,,,,,,,,,"Located at Iowa State"
246,"Frank Olsen Drawer 45",2014-000246,SPM010585,"Lithacodes fasciola","Yellow-shouldered Slug Moth",Iowa,Clarke,2007-06-02,,"Red Fern Timber",40.98317,-93.75317,"Frank Olsen",adult,,Pinned,1,,,,,,,,,"Located at Iowa State"
289,"Frank Olsen Drawer 26",2014-000289,SPM010625,"Scopula limboundata","Large Lace-border Moth",Iowa,Clarke,2007-06-02,,"Red Fern Timber",40.98317,-93.75317,"Frank Olsen",adult,,Pinned,1,,,,,,,,,"Located at Iowa State"
361,"Frank Olsen Drawer 41",2014-000361,SPM010689,"Maliattha synochitis","Black-dotted Maliattha",Iowa,Clarke,2007-06-02,,"Red Fern Timber",40.98317,-93.75317,"Frank Olsen",adult,,Pinned,1,,,,,,,,,"Located at Iowa State"
365,"Frank Olsen Drawer 41",2014-000365,SPM010693,"Protodeltote muscosula","Large Mossy Lithacodia",Iowa,Clarke,2007-06-02,,"Red Fern Timber",40.98317,-93.75317,"Frank Olsen",adult,,Pinned,1,,,,,,,,,"Located at Iowa State"
372,"Frank Olsen Drawer 41",2014-000372,SPM010699,"Pseudeustrotia carneola","Pink-barred Pseudeustrotia",Iowa,Clarke,2007-06-02,,"Red Fern Timber",40.98317,-93.75317,"Frank Olsen",adult,,Pinned,1,,,,,,,,,"Located at Iowa State"
411,"Frank Olsen Drawer 26",2014-000411,SPM010740,"Scopula limboundata","Large Lace-border Moth",Iowa,Clarke,2007-06-02,,"Red Fern Timber",40.98317,-93.75317,"Frank Olsen",adult,,Pinned,1,,,,,,,,,"Located at Iowa State"
453,"Frank Olsen Drawer 36",2014-000453,SPM010777,"Leuconycta lepidula","Marbled-green Leuconycta Moth",Iowa,Clarke,2007-06-02,,"Red Fern Timber",40.98317,-93.75317,"Frank Olsen",adult,,Pinned,1,,,,,,,,,"Located at Iowa State"
1007,"Frank Olsen Drawer 17",2014-001007,SPM010369,"Desmia funeralis-maculalis",None,Iowa,Clarke,2007-06-02,,"Red Fern Timber",40.98317,-93.75317,"Frank Olsen",adult,,Pinned,1,,,,,,,,,"Located at Iowa State"
1010,"Frank Olsen Drawer 47",2014-001010,SPM010372,"Desmia funeralis-maculalis",None,Iowa,Clarke,2007-06-02,,"Red Fern Timber",40.98317,-93.75317,"Frank Olsen",adult,,Pinned,1,,,,,,,,,"Located at Iowa State"
1069,"Frank Olsen Drawer 22",2014-001069,SPM010426,"Eubaphe mendica","The Beggar",Iowa,Clarke,2007-06-02,,"Red Fern Timber",40.98317,-93.75317,"Frank Olsen",adult,,Pinned,1,,,,,,,,,"Located at Iowa State"
1080,,2014-001080,SPM010436,"Nadata gibbosa","White-dotted Prominent Moth",Iowa,Clarke,2007-06-02,,"Red Fern Timber",40.98317,-93.75317,"Frank Olsen",adult,,Pinned,1,,,,,,,,,"to verify"
11141,,2014-011423,SPM020853,"Archips purpurana","Omnivorous Leafroller Moth",Iowa,Clarke,2010-07-25,,"Red Fern Timber",40.98317,-93.75317,"Frank Olsen",adult,,Pinned,1,,,,,,,,,"Located at Iowa State"
11512,"Frank Olsen Drawer 17",2014-011794,SPM037331,"Herpetogramma bipunctalis","Southern Beet Webworm Moth",Iowa,Clarke,2013-10-11,,"Red Fern Timber",40.98317,-93.75317,"Frank Olsen",adult,,Pinned,1,,,,,,,,,"Located at Iowa State"
12805,,2014-013087,SPM020847,"Acrobasis caryae","Hickory Shoot Borer Moth",Iowa,Clarke,2010-07-25,,"Red Fern Timber",40.98317,-93.75317,"Frank Olsen",adult,,Pinned,1,,,,,,,,,"Located at Iowa State"
13049,"Frank Olsen Drawer 10",2014-013331,SPM013318,"Acrolophus mora",None,Iowa,Clarke,2008-08-14,,"Red Fern Timber",40.98317,-93.75317,"Frank Olsen",adult,,Pinned,1,,,,,,,,,"Located at Iowa State"
13234,"Frank Olsen Drawer 10",2014-013516,SPM037918,"Acrolophus popeanella","Clemen's Grass-tubeworm Moth",Iowa,Clarke,2013-08-03,,"Red Fern Timber",40.98317,-93.75317,"Frank Olsen",adult,,Pinned,1,,,,,,,,,"Located at Iowa State"
13286,"Frank Olsen Drawer 36",2014-013568,SPM010349,"Acronicta americana","American Dagger Moth",Iowa,Clarke,2007-06-02,,"Red Fern Timber",40.98317,-93.75317,"Frank Olsen",adult,,Pinned,1,,,,,,,,,"Located at Iowa State"
13344,"Frank Olsen Drawer 31",2014-013626,SPM020403,"Acronicta clarescens","Clear Dagger Moth",Iowa,Clarke,2010-07-25,,"Red Fern Timber",40.98317,-93.75317,"Frank Olsen",adult,,Pinned,1,,,,,,,,,"Located at Iowa State"
13515,"Frank Olsen Drawer 31",2014-013797,SPM013362,"Acronicta increta","Eclipsed Oak Dagger",Iowa,Clarke,2008-08-14,,"Red Fern Timber",40.98317,-93.75317,"Frank Olsen",adult,,Pinned,1,,,,,,,,,"Located at Iowa State"
13610,"Frank Olsen Drawer 36",2014-013892,SPM024707,"Acronicta lepusculina","Cottonwood Dagger Moth",Iowa,Clarke,2011-07-24,,Redacted,Redacted,Redacted,"Frank Olsen",adult,,Pinned,1,,,,,,,,,"Located at Iowa State"
13756,"Frank Olsen Drawer 36",2014-014038,SPM037887,"Acronicta rubricoma","Ruddy Dagger Moth",Iowa,Clarke,2013-08-03,,"Red Fern Timber",40.98317,-93.75317,"Frank Olsen",adult,,Pinned,1,,,,,,,,,"Located at Iowa State"
13845,,2014-014127,SPM020959,"Actias luna","Luna Moth",Iowa,Clarke,2010-07-25,,"Red Fern Timber",40.98317,-93.75317,"Frank Olsen",adult,,Sighting,1,,,,,,,,,
13846,,2014-014128,SPM020960,"Actias luna","Luna Moth",Iowa,Clarke,2008-08-14,,"Red Fern Timber",40.98317,-93.75317,"Frank Olsen",adult,,Sighting,1,,,,,,,,,
13884,,2014-014166,SPM039143,"Actias luna","Luna Moth",Iowa,Clarke,2013-08-03,,"Red Fern Timber",40.98317,-93.75317,"Frank Olsen",adult,,Sighting,1,,,,,,,,,
14076,"Frank Olsen Drawer 17",2014-014361,SPM037881,"Aglossa cuprina","Grease Moth",Iowa,Clarke,2013-08-03,,"Red Fern Timber",40.98317,-93.75317,"Frank Olsen",adult,,Pinned,1,,,,,,,,,"Located at Iowa State"
14127,"Frank Olsen Drawer 08",2014-014412,SPM024740,"Agnorisma badinodis","Pale-banded Dart",Iowa,Clarke,2011-09-27,,"Red Fern Timber",40.98317,-93.75317,"Frank Olsen",adult,,Pinned,1,,,,,,,,,"Located at Iowa State"
14134,"Frank Olsen Drawer 08",2014-014419,SPM037401,"Agnorisma badinodis","Pale-banded Dart",Iowa,Clarke,2013-10-11,,"Red Fern Timber",40.98317,-93.75317,"Frank Olsen",adult,,Pinned,1,,,,,,,,,"Located at Iowa State"
14292,"Frank Olsen Drawer 17",2014-014577,SPM025140,"Agriphila vulgivagellus","Vagabond Crambus",Iowa,Clarke,2011-09-27,,"Red Fern Timber",40.98317,-93.75317,"Frank Olsen",adult,,Pinned,1,,,,,,,,,"Located at Iowa State"
14457,"Frank Olsen Drawer 07",2014-014743,SPM032959,"Agrotis ipsilon","Ipsilion Dart",Iowa,Clarke,2012-11-21,,"Red Fern Timber",40.98317,-93.75317,"Frank Olsen",adult,,Pinned,1,,,,,,,,,"Located at Iowa State"
15022,,2014-015318,SPM037335,"Anageshna primordialis","Yellow-spotted Webworm Moth",Iowa,Clarke,2013-10-11,,"Red Fern Timber",40.98317,-93.75317,"Frank Olsen",adult,,Pinned,1,,,,,,,,,"Located at Iowa State"
15249,"Frank Olsen Drawer 19",2014-015545,SPM012737,"Anavitrinella pampinaria","Common Gray",Iowa,Clarke,2008-08-14,,"Red Fern Timber",40.98317,-93.75317,"Frank Olsen",adult,,Pinned,1,,,,,,,,,"Located at Iowa State"
15627,"Frank Olsen Drawer 49",2014-015923,SPM037203,"Antaeotricha leucillana","Pale Gray Bird-dropping Moth",Iowa,Clarke,2013-08-03,,"Red Fern Timber",40.98317,-93.75317,"Frank Olsen",adult,,Pinned,1,,,,,,,,,"Located at Iowa State"
15715,"Frank Olsen Drawer 40",2014-016011,SPM032590,"Anterastria teratophora","Gray Marvel Moth",Iowa,Clarke,2012-05-27,,"Red Fern Timber",40.98317,-93.75317,"Frank Olsen",adult,,Pinned,1,,,,,,,,,"Located at Iowa State"
16131,"Frank Olsen Drawer 10",2014-016429,SPM010365,"Apoda y-inversa","Yellow-collared Slug Moth",Iowa,Clarke,2007-06-02,,"Red Fern Timber",40.98317,-93.75317,"Frank Olsen",adult,,Pinned,1,,,,,,,,,"Located at Iowa State"
16174,"Frank Olsen Drawer 10",2014-016472,SPM031716,"Apoda y-inversa","Yellow-collared Slug Moth",Iowa,Clarke,2012-05-27,,"Red Fern Timber",40.98317,-93.75317,"Frank Olsen",adult,,Pinned,1,,,,,,,,,"Located at Iowa State"
16184,"Frank Olsen Drawer 10",2014-016482,SPM037205,"Apoda y-inversa","Yellow-collared Slug Moth",Iowa,Clarke,2013-08-03,,"Red Fern Timber",40.98317,-93.75317,"Frank Olsen",adult,,Pinned,1,,,,,,,,,"Located at Iowa State"
16440,,2014-016738,SPM020855,"Archips purpurana","Omnivorous Leafroller Moth",Iowa,Clarke,2010-07-25,,"Red Fern Timber",40.98317,-93.75317,"Frank Olsen",adult,,Pinned,1,,,,,,,,,"Located at Iowa State"
16779,"Frank Olsen Drawer 49",2014-017078,SPM016056,"Argyrotaenia velutinana","Red Banded Leafroller Moth",Iowa,Clarke,2009-04-16,,"Red Fern Timber",40.98317,-93.75317,"Frank Olsen",adult,,Pinned,1,,,,,,,,,"Located at Iowa State"
16780,"Frank Olsen Drawer 49",2014-017079,SPM016057,"Argyrotaenia velutinana","Red Banded Leafroller Moth",Iowa,Clarke,2009-04-16,,"Red Fern Timber",40.98317,-93.75317,"Frank Olsen",adult,,Pinned,1,,,,,,,,,"Located at Iowa State"
16802,"Frank Olsen Drawer 49",2014-017101,SPM020889,"Argyrotaenia velutinana","Red Banded Leafroller Moth",Iowa,Clarke,2010-07-25,,"Red Fern Timber",40.98317,-93.75317,"Frank Olsen",adult,,Pinned,1,,,,,,,,,"Located at Iowa State"
17216,"Frank Olsen Drawer 10",2014-017515,SPM020301,"Atteva aurea","Ailanthus Webworm Moth",Iowa,Clarke,2010-07-25,,"Red Fern Timber",40.98317,-93.75317,"Frank Olsen",adult,,Pinned,1,,,,,,,,,"Located at Iowa State"
17324,,2014-017623,SPM037917,"Autographa precationis","The Common Looper Moth",Iowa,Clarke,2013-10-11,,"Red Fern Timber",40.98317,-93.75317,"Frank Olsen",adult,,Photograph,1,,,,,,,,,
17419,"Frank Olsen Drawer 36",2014-017719,SPM012805,"Bagisara rectifascia","Straight Lined Mallow Moth",Iowa,Clarke,2008-08-14,,"Red Fern Timber",40.98317,-93.75317,"Frank Olsen",adult,,Pinned,1,,,,,,,,,"Located at Iowa State"
17942,"Frank Olsen Drawer 12",2014-018242,SPM031745,"Cabera quadrifasciaria","Four-lined Cabera Moth",Iowa,Clarke,2012-05-27,,"Red Fern Timber",40.98317,-93.75317,"Frank Olsen",adult,,Pinned,1,,,,,,,,,"Located at Iowa State"
18097,"Frank Olsen Drawer 39",2014-018397,SPM020157,"Caenurgina erechtea","Forage Looper Moth",Iowa,Clarke,2010-07-25,,"Red Fern Timber",40.98317,-93.75317,"Frank Olsen",adult,,Pinned,1,,,,,,,,,"Located at Iowa State"
18622,"Frank Olsen Drawer 13",2014-018945,SPM031751,"Campaea perlata","Pale Beauty",Iowa,Clarke,2012-05-27,,"Red Fern Timber",40.98317,-93.75317,"Frank Olsen",adult,,Pinned,1,,,,,,,,,"Located at Iowa State"
19095,"Frank Olsen Drawer 61",2014-019418,SPM037268,"Catocala habilis","Habilis Underwing",Iowa,Clarke,2013-08-03,,"Red Fern Timber",40.98317,-93.75317,"Frank Olsen",adult,,Pinned,1,,,,,,,,,"Located at Iowa State"
19171,"Frank Olsen Drawer 63",2014-019494,SPM037359,"Catocala ilia","Ilia Underwing",Iowa,Clarke,2013-08-03,,"Red Fern Timber",40.98317,-93.75317,"Frank Olsen",adult,,Pinned,1,,,,,,,,,"Located at Iowa State"
19238,"Frank Olsen Drawer 66",2014-019561,SPM037277,"Catocala insolabilis","Inconsolable Underwing",Iowa,Clarke,2013-08-03,,"Red Fern Timber",40.98317,-93.75317,"Frank Olsen",adult,,Pinned,1,,,,,,,,,"Located at Iowa State"
19260,"Frank Olsen Drawer 61",2014-019584,SPM037272,"Catocala judith","Judith's Underwing",Iowa,Clarke,2013-08-03,,"Red Fern Timber",40.98317,-93.75317,"Frank Olsen",adult,,Pinned,1,,,,,,,,,"Located at Iowa State"
19261,"Frank Olsen Drawer 61",2014-019585,SPM037273,"Catocala judith","Judith's Underwing",Iowa,Clarke,2013-08-03,,"Red Fern Timber",40.98317,-93.75317,"Frank Olsen",adult,,Pinned,1,,,,,,,,,"Located at Iowa State"
19571,"Frank Olsen Drawer 65",2014-019902,SPM020082,"Catocala retecta","The Yellow-Gray Underwing",Iowa,Clarke,2010-07-25,,"Red Fern Timber",40.98317,-93.75317,"Frank Olsen",adult,,Pinned,1,,,,,,,,,"Located at Iowa State"
19750,"Frank Olsen Drawer 66",2014-020081,SPM037356,"Catocala vidua","Widow Underwing",Iowa,Clarke,2013-10-11,,"Red Fern Timber",40.98317,-93.75317,"Frank Olsen",adult,,Pinned,1,,,,,,,,,"Located at Iowa State"
19976,"Frank Olsen Drawer 08",2014-020307,SPM016451,"Cerastis tenebrifera","Reddish Speckled Dart",Iowa,Clarke,2009-04-16,,"Red Fern Timber",40.98317,-93.75317,"Frank Olsen",adult,,Pinned,1,,,,,,,,,"Located at Iowa State"
20094,"Frank Olsen Drawer 28",2014-020427,SPM024330,"Ceratomia hageni","Hagen's Sphinx Moth",Iowa,Clarke,2011-07-24,,Redacted,Redacted,Redacted,"Frank Olsen",adult,,Pinned,1,,,,,,,,,"Located at Iowa State"
20095,"Frank Olsen Drawer 28",2014-020428,SPM024331,"Ceratomia hageni","Hagen's Sphinx Moth",Iowa,Clarke,2011-07-24,,Redacted,Redacted,Redacted,"Frank Olsen",adult,,Pinned,1,,,,,,,,,"Located at Iowa State"
20123,"Frank Olsen Drawer 23",2014-020456,SPM010303,"Ceratomia undulosa","Waved Sphinx Moth",Iowa,Clarke,2007-06-02,,"Red Fern Timber",40.98317,-93.75317,"Frank Olsen",adult,,Pinned,1,,,,,,,,,"Located at Iowa State"
20598,"Frank Olsen Drawer 08",2014-020935,SPM024743,"Choephora fungorum","Bent-Lined Dart",Iowa,Clarke,2011-09-27,,"Red Fern Timber",40.98317,-93.75317,"Frank Olsen",adult,,Pinned,1,,,,,,,,,"Located at Iowa State"
21108,"Frank Olsen Drawer 50",2014-021445,SPM024685,"Cisseps fulvicollis","Yellow-Collared Scape Moth",Iowa,Clarke,2011-09-27,,"Red Fern Timber",40.98317,-93.75317,"Frank Olsen",adult,,Pinned,1,,,,,,,,,"Located at Iowa State"
22058,"Frank Olsen Drawer 43",2014-022395,SPM020357,"Costaconvexa centrostrigaria","The Bent-line Carpet",Iowa,Clarke,2010-07-25,,"Red Fern Timber",40.98317,-93.75317,"Frank Olsen",adult,,Pinned,1,,,,,,,,,"Located at Iowa State"
22274,,2014-022611,SPM013324,"Crambidia pallida","Pale Lichen Moth",Iowa,Clarke,2008-08-14,,"Red Fern Timber",40.98317,-93.75317,"Frank Olsen",adult,,Photograph,1,,,,,,,,,
23038,"Frank Olsen Drawer 54",2014-023382,SPM031783,"Darapsa myron","Virginia Creeper Sphinx Moth",Iowa,Clarke,2012-05-27,,"Red Fern Timber",40.98317,-93.75317,"Frank Olsen",adult,,Pinned,1,,,,,,,,,"Located at Iowa State"
23100,"Frank Olsen Drawer 02",2014-023445,SPM037909,"Dargida diffusa","Wheat Head Armyworm Moth",Iowa,Clarke,2013-08-03,,"Red Fern Timber",40.98317,-93.75317,"Frank Olsen",adult,,Pinned,1,,,,,,,,,"Located at Iowa State"
23424,"Frank Olsen Drawer 17",2014-023770,SPM013052,"Desmia funeralis-maculalis",None,Iowa,Clarke,2008-08-14,,"Red Fern Timber",40.98317,-93.75317,"Frank Olsen",adult,,Pinned,1,,,,,,,,,"Located at Iowa State"
23439,"Frank Olsen Drawer 17",2014-023785,SPM020320,"Desmia funeralis-maculalis",None,Iowa,Clarke,2010-07-25,,"Red Fern Timber",40.98317,-93.75317,"Frank Olsen",adult,,Pinned,1,,,,,,,,,"Located at Iowa State"
23468,"Frank Olsen Drawer 17",2014-023814,SPM031723,"Desmia funeralis-maculalis",None,Iowa,Clarke,2012-05-27,,"Red Fern Timber",40.98317,-93.75317,"Frank Olsen",adult,,Pinned,1,,,,,,,,,"Located at Iowa State"
23469,"Frank Olsen Drawer 17",2014-023815,SPM031724,"Desmia funeralis-maculalis",None,Iowa,Clarke,2012-05-27,,"Red Fern Timber",40.98317,-93.75317,"Frank Olsen",adult,,Pinned,1,,,,,,,,,"Located at Iowa State"
23481,"Frank Olsen Drawer 17",2014-023827,SPM037211,"Desmia funeralis-maculalis",None,Iowa,Clarke,2013-08-03,,"Red Fern Timber",40.98317,-93.75317,"Frank Olsen",adult,,Pinned,1,,,,,,,,,"Located at Iowa State"
23495,"Frank Olsen Drawer 47",2014-023841,SPM013055,"Desmia funeralis-maculalis",None,Iowa,Clarke,2008-08-14,,"Red Fern Timber",40.98317,-93.75317,"Frank Olsen",adult,,Pinned,1,,,,,,,,,"Located at Iowa State"
23498,"Frank Olsen Drawer 47",2014-023844,SPM020322,"Desmia funeralis-maculalis",None,Iowa,Clarke,2010-07-25,,"Red Fern Timber",40.98317,-93.75317,"Frank Olsen",adult,,Pinned,1,,,,,,,,,"Located at Iowa State"
23783,"Frank Olsen Drawer 46",2014-024129,SPM032529,"Digrammia continuata","Curve-lined Angle",Iowa,Clarke,2012-09-09,,"Red Fern Timber",40.98317,-93.75317,"Frank Olsen",adult,,Pinned,1,,,,,,,,,"Located at Iowa State"
23784,"Frank Olsen Drawer 46",2014-024130,SPM032530,"Digrammia continuata","Curve-lined Angle",Iowa,Clarke,2012-09-09,,"Red Fern Timber",40.98317,-93.75317,"Frank Olsen",adult,,Pinned,1,,,,,,,,,"Located at Iowa State"
24328,,2014-024675,SPM017433,"Eacles imperialis","Imperial Moth",Iowa,Clarke,2000-07-22,,"I-35 Rest Area",41.01278,-93.795,"Tom Jantscher",adult,,Photograph,1,,,,,,,,,
24778,"Frank Olsen Drawer 57",2014-025125,SPM037254,"Ellida caniplaga","Linden Prominent Moth",Iowa,Clarke,2013-08-03,,"Red Fern Timber",40.98317,-93.75317,"Frank Olsen",adult,,Pinned,1,,,,,,,,,"Located at Iowa State"
24779,"Frank Olsen Drawer 57",2014-025126,SPM037255,"Ellida caniplaga","Linden Prominent Moth",Iowa,Clarke,2013-08-03,,"Red Fern Timber",40.98317,-93.75317,"Frank Olsen",adult,,Pinned,1,,,,,,,,,"Located at Iowa State"
24857,,2014-025204,SPM020845,"Anageshna primordialis","Yellow-spotted Webworm Moth",Iowa,Clarke,2010-07-25,,"Red Fern Timber",40.98317,-93.75317,"Frank Olsen",adult,,Pinned,1,,,,,,,,,"Located at Iowa State"
24859,"Frank Olsen Drawer 48",2014-025206,SPM020864,"Elophila obliteralis","Waterlily Leafcutter Moth",Iowa,Clarke,2010-07-25,,"Red Fern Timber",40.98317,-93.75317,"Frank Olsen",adult,,Pinned,1,,,,,,,,,"Located at Iowa State"
24933,,2014-025280,SPM037936,"Elophila obliteralis","Waterlily Leafcutter Moth",Iowa,Clarke,2013-10-11,,"Red Fern Timber",40.98317,-93.75317,"Frank Olsen",adult,,Photograph,1,,,,,,,,,
24980,,2014-025327,SPM037939,"Emmelina monodactyla","Morning-glory Plume Moth",Iowa,Clarke,2013-10-11,,"Red Fern Timber",40.98317,-93.75317,"Frank Olsen",adult,,Pinned,1,,,,,,,,,"Located at Iowa State"
26055,"Frank Olsen Drawer 22",2014-026403,SPM031772,"Eubaphe mendica","The Beggar",Iowa,Clarke,2012-05-27,,"Red Fern Timber",40.98317,-93.75317,"Frank Olsen",adult,,Pinned,1,,,,,,,,,"Located at Iowa State"
26061,"Frank Olsen Drawer 22",2014-026409,SPM037244,"Eubaphe mendica","The Beggar",Iowa,Clarke,2013-08-03,,"Red Fern Timber",40.98317,-93.75317,"Frank Olsen",adult,,Pinned,1,,,,,,,,,"Located at Iowa State"
26082,,2014-026430,SPM015771,"Euchaetes egle","Milkweed Tussock Moth",Iowa,Clarke,2008-08-06,,"Coyote Canyon",41.1213,-93.8614,"Aaron Brees",adult,,Photograph,1,,,,,,,,,
26754,"Frank Olsen Drawer 26",2014-027102,SPM032551,"Eulithis diversilineata-gracilineata",None,Iowa,Clarke,2012-09-09,,"Red Fern Timber",40.98317,-93.75317,"Frank Olsen",adult,,Pinned,1,,,,,,,,,"Located at Iowa State"
26772,"Frank Olsen Drawer 26",2014-027120,SPM037240,"Eulithis diversilineata-gracilineata",None,Iowa,Clarke,2013-08-03,,"Red Fern Timber",40.98317,-93.75317,"Frank Olsen",adult,,Pinned,1,,,,,,,,,"Located at Iowa State"
27159,"Frank Olsen Drawer 43",2014-027512,SPM016165,"Eupithecia miserulata","Common Eupithecia",Iowa,Clarke,2009-04-16,,"Red Fern Timber",40.98317,-93.75317,"Frank Olsen",adult,,Pinned,1,,,,,,,,,"Located at Iowa State"
27840,"Frank Olsen Drawer 07",2014-028193,SPM032642,"Feltia herilis","Master's Dart",Iowa,Clarke,2012-09-09,,"Red Fern Timber",40.98317,-93.75317,"Frank Olsen",adult,,Pinned,1,,,,,,,,,"Located at Iowa State"
28027,"Frank Olsen Drawer 57",2014-028380,SPM037256,"Furcula cinerea","Gray Furcula Moth",Iowa,Clarke,2013-08-03,,"Red Fern Timber",40.98317,-93.75317,"Frank Olsen",adult,,Pinned,1,,,,,,,,,"Located at Iowa State"
28570,,2014-028923,SPM032023,"Apantesis virguncula","Little Virgin Tiger Moth",Iowa,Clarke,2012-05-27,,"Red Fern Timber",40.98317,-93.75317,"Frank Olsen",adult,,Photograph,1,,,,,,,,,
28871,,2014-029224,SPM039160,"Haematopis grataria","Chickweed Geometer",Iowa,Clarke,2013-10-11,,"Red Fern Timber",40.98317,-93.75317,"Frank Olsen",adult,,Sighting,1,,,,,,,,,
29195,"Frank Olsen Drawer 52",2014-029548,SPM032012,"Haploa lecontei","Leconte's Haploa Moth",Iowa,Clarke,2012-05-27,,"Red Fern Timber",40.98317,-93.75317,"Frank Olsen",adult,,Pinned,1,,,,,,,,,"Located at Iowa State"
29196,"Frank Olsen Drawer 52",2014-029549,SPM032013,"Haploa lecontei","Leconte's Haploa Moth",Iowa,Clarke,2012-05-27,,"Red Fern Timber",40.98317,-93.75317,"Frank Olsen",adult,,Pinned,1,,,,,,,,,"Located at Iowa State"
29197,"Frank Olsen Drawer 52",2014-029550,SPM032014,"Haploa lecontei","Leconte's Haploa Moth",Iowa,Clarke,2012-05-27,,"Red Fern Timber",40.98317,-93.75317,"Frank Olsen",adult,,Pinned,1,,,,,,,,,"Located at Iowa State"
29496,"Frank Olsen Drawer 04",2014-029849,SPM032650,"Helicoverpa zea","Corn Earworm Moth",Iowa,Clarke,2012-09-09,,"Red Fern Timber",40.98317,-93.75317,"Frank Olsen",adult,,Pinned,1,,,,,,,,,"Located at Iowa State"
29650,,2014-030003,SPM015767,"Hemaris diffinis","Snowberry Clearwing Moth",Iowa,Clarke,2008-08-06,,"Coyote Canyon",41.1213,-93.8614,"Aaron Brees",adult,,Photograph,1,,,,,,,,,
29986,"Frank Olsen Drawer 57",2014-030346,SPM020171,"Cecrita guttivitta","Maple Prominent Moth",Iowa,Clarke,2010-07-25,,"Red Fern Timber",40.98317,-93.75317,"Frank Olsen",adult,,Pinned,1,,,,,,,,,"Located at Iowa State"
30003,"Frank Olsen Drawer 57",2014-030363,SPM037257,"Heterocampa obliqua","Oblique Heterocampa Moth",Iowa,Clarke,2013-08-03,,"Red Fern Timber",40.98317,-93.75317,"Frank Olsen",adult,,Pinned,1,,,,,,,,,"Located at Iowa State"
30326,"Frank Olsen Drawer 41",2014-030686,SPM025183,"Homophoberia apicosa","Black Wedge-spot",Iowa,Clarke,2011-09-27,,"Red Fern Timber",40.98317,-93.75317,"Frank Olsen",adult,,Pinned,1,,,,,,,,,"Located at Iowa State"