ID,"Collection / Source","Catalog Number","Specify Number",Taxon,"Common Name",State,County,Date,Time,Locale,Latitude,Longitude,Collector,"Life Stage","Collection Method","Preparation Type",Count,Temperature,Humidity,"Dew Point",Wind,"Wind Direction","Barometric Pressure",Sky,"Moon Phase",Notes
6362,,2014-006643,,"Vanessa virginiensis","American Lady",Iowa,Dubuque,1950-07-01,,"Dubuque County",42.469467,-90.829399," USGS - NPWRC",adult,Sighting,Sighting,1,,,,,,,,,"HIstorical Record"
64219,,2014-064820,,"Vanessa virginiensis","American Lady",Iowa,Dubuque,2013-06-01,,"Catfish Creek State Preserve",42.4679,-90.6553,"Frank Olsen",adult,Sighting,Sighting,1,,,,,,,,,
64315,,2014-064916,,"Vanessa virginiensis","American Lady",Iowa,Dubuque,2013-06-01,,"Pohlman Prairie",42.561448,-90.745365,"Frank Olsen",adult,Sighting,Sighting,1,,,,,,,,,
64316,,2014-064917,,"Vanessa virginiensis","American Lady",Iowa,Dubuque,2013-06-10,,"Pohlman Prairie",42.561448,-90.745365,"Frank Olsen",adult,Sighting,Sighting,1,,,,,,,,,
120134,,2015-010692,,"Vanessa virginiensis","American Lady",Iowa,Dubuque,2009-05-29,,"Mines of Spain State Recreational Area",42.456547,-90.631099,"Chris Edwards",adult,Sighting,Sighting,3,,,,,,,,,
240565,,,,"Vanessa virginiensis","American Lady",Iowa,Dubuque,2019-07-06,0950-1130,"Pohlman Prairie",42.560363,-90.749433,"Frank Olsen",adult,Sighting,Sighting,1," 71-77",,,0-3,45,," mostly sun",,
263744,,,,"Vanessa virginiensis","American Lady",Iowa,Dubuque,2017-06-21,10:00,"Mines of Spain State Recreational Area",42.450603,-90.629164,IBSN,adult,Sighting,Sighting,3,73,,,Windy,,,"Partly Cloudy",,
263781,,,,"Vanessa virginiensis","American Lady",Iowa,Dubuque,2017-06-25,14:30,"Swiss Valley Nature Preserve",42.418039,-90.758747,IBSN,adult,Sighting,Sighting,1,66,,,Windy,,,"Mostly Cloudy",,
263782,,,,"Vanessa virginiensis","American Lady",Iowa,Dubuque,2017-07-04,11:45,"Swiss Valley Nature Preserve",42.418039,-90.758747,IBSN,adult,Sighting,Sighting,1,76,,,"Relatively Still",,,"Partly Cloudy",,
263783,,,,"Vanessa virginiensis","American Lady",Iowa,Dubuque,2017-09-09,14:15,"Swiss Valley Nature Preserve",42.418039,-90.758747,IBSN,adult,Sighting,Sighting,1,73,,,Calm,,,"Mostly Clear",,
330944,,,,"Vanessa virginiensis","American Lady",Iowa,Dubuque,2022-07-30,,"Dubuque Arboretum and Botanical Gardens",42.532876,-90.716293,IBSN,adult,Sighting,Sighting,1,81,,,Calm,,,"Partly Cloudy",,
359546,,,,"Vanessa virginiensis","American Lady",Iowa,Dubuque,2024-04-25,,"Swiss Valley Nature Preserve",42.421185,-90.762425,"Jim Durbin",adult,Sighting,Photograph,1,,,,,,,,,
