ID,"Collection / Source","Catalog Number","Specify Number",Taxon,"Common Name",State,County,Date,Time,Locale,Latitude,Longitude,Collector,"Life Stage","Collection Method","Preparation Type",Count,Temperature,Humidity,"Dew Point",Wind,"Wind Direction","Barometric Pressure",Sky,"Moon Phase",Notes
4311,,2014-004592,,"Nymphalis antiopa","Mourning Cloak",Iowa,Fremont,1950-07-01,,Sidney,40.74004,-95.645798," USGS - NPWRC",adult,Sighting,Sighting,1,,,,,,,,,"HIstorical Record"
4373,,2014-004654,,"Nymphalis l-album","Compton's Tortisehell",Iowa,Fremont,1950-07-01,,Sidney,40.74004,-95.645798," USGS - NPWRC",adult,Sighting,Sighting,1,,,,,,,,,"HIstorical Record"
9114,,2014-009395,,"Nymphalis antiopa","Mourning Cloak",Iowa,Fremont,2012-09-09,,"Waubonsie State Park",40.676,-95.689,"Tom Jantscher",adult,Sighting,Sighting,1,,,,,,,,,
9115,,2014-009396,,"Nymphalis antiopa","Mourning Cloak",Iowa,Fremont,2012-09-09,,"Waubonsie State Park",40.676,-95.689,"Tom Jantscher",adult,Sighting,Sighting,1,,,,,,,,,
9116,,2014-009397,,"Nymphalis antiopa","Mourning Cloak",Iowa,Fremont,2012-09-09,,"Waubonsie State Park",40.676,-95.689,"Tom Jantscher",adult,Sighting,Sighting,1,,,,,,,,,
58533,,2014-058915,,"Nymphalis antiopa","Mourning Cloak",Iowa,Fremont,2012-04-01,,"Waubonsie State Park",40.676,-95.689,"Ed Freese",adult,Sighting,Sighting,1,,,,,,,,,
58534,,2014-058916,,"Nymphalis antiopa","Mourning Cloak",Iowa,Fremont,2010-07-02,,"Waubonsie State Park",40.676,-95.689,"Frank Olsen",adult,Sighting,Sighting,1,,,,,,,,,
110093,,2015-000649,,"Nymphalis antiopa","Mourning Cloak",Iowa,Fremont,2014-05-03,,"Waubonsie State Park",40.676,-95.689,"Ed Freese",adult,Sighting,Sighting,1,,,,,,,,,
199881,,2017-017238,,"Nymphalis antiopa","Mourning Cloak",Iowa,Fremont,2017-04-23,,"Waubonsie State Park",40.676,-95.689,"Frank Olsen",adult,Sighting,Sighting,1,72,,,8,210,," P. sunny",,
