ID,"Collection / Source","Catalog Number","Specify Number",Taxon,"Common Name",State,County,Date,Time,Locale,Latitude,Longitude,Collector,"Life Stage","Collection Method","Preparation Type",Count,Temperature,Humidity,"Dew Point",Wind,"Wind Direction","Barometric Pressure",Sky,"Moon Phase",Notes
3413,,2014-003694,,"Cupido comyntas","Eastern-tailed Blue",Iowa,Henry,1950-08-01,,"Henry County",41.028358,-91.598396," USGS - NPWRC",adult,Sighting,Sighting,1,,,,,,,,,"HIstorical Record"
56209,,2014-056591,,"Cupido comyntas","Eastern-tailed Blue",Iowa,Henry,2005-08-14,,"Jarvis Wetland Mitigation",40.9869,-91.6609,"Dennis Schlicht",adult,Sighting,Sighting,2,,,,,,,,,
56210,,2014-056592,,"Cupido comyntas","Eastern-tailed Blue",Iowa,Henry,2005-09-03,,"Jarvis Wetland Mitigation",40.9869,-91.6609,"Dennis Schlicht",adult,Sighting,Sighting,3,,,,,,,,,
56211,,2014-056593,,"Cupido comyntas","Eastern-tailed Blue",Iowa,Henry,2005-07-20,,"Jarvis Wetland Mitigation",40.9869,-91.6609,"Frank Olsen",adult,Sighting,Sighting,3,,,,,,,,,
56212,,2014-056594,,"Cupido comyntas","Eastern-tailed Blue",Iowa,Henry,2005-08-01,,"Jarvis Wetland Mitigation",40.9869,-91.6609,"Frank Olsen",adult,Sighting,Sighting,4,,,,,,,,,
56213,,2014-056595,,"Cupido comyntas","Eastern-tailed Blue",Iowa,Henry,2005-08-23,,"Jarvis Wetland Mitigation",40.9869,-91.6609,"Frank Olsen",adult,Sighting,Sighting,8,,,,,,,,,
56214,,2014-056596,,"Cupido comyntas","Eastern-tailed Blue",Iowa,Henry,2005-05-08,,"Jarvis Wetland Mitigation",40.9869,-91.6609,"Frank Olsen",adult,Sighting,Sighting,1,,,,,,,,,
318301,,,,"Cupido comyntas","Eastern-tailed Blue",Iowa,Henry,2022-08-06,,"Geode State Park",40.816704,-91.388116,"Jay Gilliam",adult,Sighting,Sighting,1,,,,,,,,,
332625,,,,"Cupido comyntas","Eastern-tailed Blue",Iowa,Henry,2022-09-18,12:54:18,"Geode State Park",40.8245220883,-91.3793441,"Mark Brown",adult,Sighting,Photograph,1,,,,,,,,,
