ID,"Collection / Source","Catalog Number","Specify Number",Taxon,"Common Name",State,County,Date,Time,Locale,Latitude,Longitude,Collector,"Life Stage","Collection Method","Preparation Type",Count,Temperature,Humidity,"Dew Point",Wind,"Wind Direction","Barometric Pressure",Sky,"Moon Phase",Notes
4493,,2014-004774,,"Pterourus glaucus","Eastern Tiger Swallowtail",Iowa,Henry,1950-08-01,,"Henry County",41.028358,-91.598396," USGS - NPWRC",adult,Sighting,Sighting,1,,,,,,,,,"HIstorical Record"
58875,,2014-059257,,"Pterourus glaucus","Eastern Tiger Swallowtail",Iowa,Henry,2005-07-20,,"Jarvis Wetland Mitigation",40.9869,-91.6609,"Frank Olsen",adult,Sighting,Sighting,2,,,,,,,,,
58876,,2014-059258,,"Pterourus glaucus","Eastern Tiger Swallowtail",Iowa,Henry,2005-08-01,,"Jarvis Wetland Mitigation",40.9869,-91.6609,"Frank Olsen",adult,Sighting,Sighting,2,,,,,,,,,
58877,,2014-059259,,"Pterourus glaucus","Eastern Tiger Swallowtail",Iowa,Henry,2005-05-17,,"Jarvis Wetland Mitigation",40.9869,-91.6609,"Frank Olsen",adult,Sighting,Sighting,1,,,,,,,,,
116660,,2015-007218,,"Pterourus glaucus","Eastern Tiger Swallowtail",Iowa,Henry,2012-04-25,,"Gibson Recreation Area",40.92403,-91.668815,"Chris Edwards",adult,Sighting,Sighting,1,,,,,,,,,
144569,,2016-009184,,"Pterourus glaucus","Eastern Tiger Swallowtail",Illinois,Henry,1960-08-12,,"Oakwood Country Club",41.450329,-90.416434,"Frank Olsen",adult,Sighting,Sighting,1,,,,,,,,,
144571,,2016-009186,,"Pterourus glaucus","Eastern Tiger Swallowtail",Illinois,Henry,1960-08-13,,"Oakwood Country Club",41.450329,-90.416434,"Frank Olsen",adult,Sighting,Sighting,1,,,,,,,,,
300379,,,,"Pterourus glaucus","Eastern Tiger Swallowtail",Iowa,Henry,2021-05-02,,"Geode State Park",40.816704,-91.388116,"Jay Gilliam",adult,Sighting,Sighting,2,,,,,,,,,
346179,,,,"Pterourus glaucus","Eastern Tiger Swallowtail",Iowa,Henry,2023-08-12,,"Geode State Park",40.816704,-91.388116,"Jay Gilliam",adult,Sighting,Photograph,2,,,,,,,,,0516
