ID,"Collection / Source","Catalog Number","Specify Number",Taxon,"Common Name",State,County,Date,Time,Locale,Latitude,Longitude,Collector,"Life Stage","Collection Method","Preparation Type",Count,Temperature,Humidity,"Dew Point",Wind,"Wind Direction","Barometric Pressure",Sky,"Moon Phase",Notes
164906,,2016-029651,,"Epitheca princeps","Prince Baskettail",Iowa,Howard,1996-08-06,,"Vernon Springs County Park",43.34694444,-92.13305556,"Bob Cruden",adult,Sighting,Sighting,1,,,,,,,,,lake
277451,,,,"Epitheca princeps","Prince Baskettail",Iowa,Howard,2020-07-20,,"Lake Hendricks Park",43.373553,-92.548032,"Jay Gilliam",adult,Sighting,Sighting,1,,,,,,,,,
277461,,,,"Epitheca princeps","Prince Baskettail",Iowa,Howard,2020-07-20,,"Vernon Springs County Park",43.346277,-92.139683,"Jay Gilliam",adult,Sighting,Sighting,1,,,,,,,,,
277497,,,,"Epitheca princeps","Prince Baskettail",Iowa,Howard,2020-07-22,,"Lake Hendricks Park",43.373553,-92.548032,"Jay Gilliam",adult,Sighting,Sighting,1,,,,,,,,,
277505,,,,"Epitheca princeps","Prince Baskettail",Iowa,Howard,2020-07-22,,"Vernon Springs County Park",43.346277,-92.139683,"Jay Gilliam",adult,Sighting,Sighting,1,,,,,,,,,
294369,"Odonate Central",,,"Epitheca princeps","Prince Baskettail",Iowa,Howard,2020-07-20,,"Vernon Springs County Park",43.346186,-92.139457,"Jay Gilliam",adult,Sighting,"Observed Only",1,,,,,,,,,
294381,"Odonate Central",,,"Epitheca princeps","Prince Baskettail",Iowa,Howard,2020-07-20,,"Lake Hendricks Park",43.373112,-92.551231,"Jay Gilliam",adult,Sighting,"Observed Only",1,,,,,,,,,
294443,"Odonate Central",,,"Epitheca princeps","Prince Baskettail",Iowa,Howard,2020-07-22,,"Vernon Springs County Park",43.346186,-92.139457,"Jay Gilliam",adult,Sighting,"Observed Only",1,,,,,,,,,
294453,"Odonate Central",,,"Epitheca princeps","Prince Baskettail",Iowa,Howard,2020-07-22,,"Lake Hendricks Park",43.373112,-92.551231,"Jay Gilliam",adult,Sighting,"Observed Only",1,,,,,,,,,
301665,,,,"Epitheca princeps","Prince Baskettail",Iowa,Howard,2021-06-19,,"Vernon Springs County Park",43.346277,-92.139683,"Jay Gilliam",adult,Sighting,Sighting,1,,,,,,,,,
301739,,,,"Epitheca princeps","Prince Baskettail",Iowa,Howard,2021-07-02,,"Vernon Springs County Park",43.346277,-92.139683,"Jay Gilliam",adult,Sighting,Sighting,6,,,,,,,,,
301818,,,,"Epitheca princeps","Prince Baskettail",Iowa,Howard,2021-07-05,,"Vernon Springs County Park",43.346277,-92.139683,"Jay Gilliam",adult,Sighting,Sighting,1,,,,,,,,,
301839,,,,"Epitheca princeps","Prince Baskettail",Iowa,Howard,2021-07-05,,"Lylahs Marsh County Park",43.286594,-92.46927,"Jay Gilliam",adult,Sighting,Sighting,1,,,,,,,,,
