ID,"Collection / Source","Catalog Number","Specify Number",Taxon,"Common Name",State,County,Date,Time,Locale,Latitude,Longitude,Collector,"Life Stage","Collection Method","Preparation Type",Count,Temperature,Humidity,"Dew Point",Wind,"Wind Direction","Barometric Pressure",Sky,"Moon Phase",Notes
2901,,2014-003182,,"Epargyreus clarus","Silver-spotted Skipper",Iowa,Jasper,1950-08-01,,"Jasper County",41.641491,-93.01757," USGS - NPWRC",adult,Sighting,Sighting,1,,,,,,,,,"HIstorical Record"
54796,,2014-055178,,"Epargyreus clarus","Silver-spotted Skipper",Iowa,Jasper,2001-08-11,,"Kish-Ke-Kosh Prairie State Preserve",41.5598,-93.0152,"Stephanie Shepherd",adult,Sighting,Sighting,1,,,,,,,,,
54820,,2014-055202,,"Epargyreus clarus","Silver-spotted Skipper",Iowa,Jasper,2012-06-04,,"Rock Creek State Park",41.7512,-92.8495,"Frank Olsen",adult,Sighting,Sighting,1,,,,,,,,,
106982,,2014-107729,,"Epargyreus clarus","Silver-spotted Skipper",Iowa,Jasper,2006-07-28,,"Brush Creek Wetland",41.5123,-93.1269,"Dennis Schlicht",adult,Sighting,Sighting,2,,,,,,,,,
106983,,2014-107730,,"Epargyreus clarus","Silver-spotted Skipper",Iowa,Jasper,2006-06-07,,"Brush Creek Wetland",41.5123,-93.1269,"Dennis Schlicht",adult,Sighting,Sighting,1,,,,,,,,,
106984,,2014-107731,,"Epargyreus clarus","Silver-spotted Skipper",Iowa,Jasper,2006-08-07,,"Brush Creek Wetland",41.51367,-93.12767,"Frank Olsen",adult,Sighting,Sighting,2,,,,,,,,,
106985,,2014-107732,,"Epargyreus clarus","Silver-spotted Skipper",Iowa,Jasper,2006-08-16,,"Brush Creek Wetland",41.51367,-93.12767,"Frank Olsen",adult,Sighting,Sighting,2,,,,,,,,,
106986,,2014-107733,,"Epargyreus clarus","Silver-spotted Skipper",Iowa,Jasper,2006-08-27,,"Brush Creek Wetland",41.51367,-93.12767,"Frank Olsen",adult,Sighting,Sighting,3,,,,,,,,,
106987,,2014-107734,,"Epargyreus clarus","Silver-spotted Skipper",Iowa,Jasper,2006-09-06,,"Brush Creek Wetland",41.51367,-93.12767,"Frank Olsen",adult,Sighting,Sighting,4,,,,,,,,,
122015,,2015-012583,,"Epargyreus clarus","Silver-spotted Skipper",Iowa,Jasper,2002-08-02,,"Neal Smith National Wildlife Refuge",41.558714,-93.278184,"Stephanie Shepherd",adult,Sighting,Sighting,1,82.4,,,3,,,"20 %cloud cover",,
122049,,2015-012636,,"Epargyreus clarus","Silver-spotted Skipper",Iowa,Jasper,2002-08-10,,"Neal Smith National Wildlife Refuge",41.581523,-93.291597,"Stephanie Shepherd",adult,Sighting,Sighting,2,87.8,,,3,,,"0 %cloud cover",,
122446,,2015-012618,,"Epargyreus clarus","Silver-spotted Skipper",Iowa,Jasper,2002-08-02,,"Neal Smith National Wildlife Refuge",41.554122,-93.269818,"Stephanie Shepherd",adult,Sighting,Sighting,2,82.4,,,0,,,"5 %cloud cover",,
130784,,2015-021374,,"Epargyreus clarus","Silver-spotted Skipper",Iowa,Jasper,2005-09-21,,Kellogg,41.718,-92.9076,"Curtis Eckerman",adult,Sighting,Photograph,1,,,,,,,,,
138537,,2016-003083,,"Epargyreus clarus","Silver-spotted Skipper",Iowa,Jasper,2005-09-21,,"Holmadahl Park",41.711754,-92.906777,"Curtis Eckerman",adult,Sighting,Photograph,1,,,,,,,,,
190795,,2017-008756,,"Epargyreus clarus","Silver-spotted Skipper",Iowa,Jasper,2016-08-03,,"Neal Smith National Wildlife Refuge",41.558683,-93.280422,"IBSN ",adult,Sighting,Sighting,2,82,,,"Relatively Still",,,Clear,,
199408,,2017-017467,,"Epargyreus clarus","Silver-spotted Skipper",Iowa,Jasper,2017-07-23,,"Jacob Krumm Nature Preserve",41.70495,-92.79146,"Frank Olsen",adult,Sighting,Sighting,1,83,,,9,300,," sunny",,
246617,,,,"Epargyreus clarus","Silver-spotted Skipper",Iowa,Jasper,2011-08-31,,"A C Morris Memorial Prairie",41.771248,-92.961948,"Frank Olsen",,Sighting,Sighting,4,,,,,,,,,
254744,,,,"Epargyreus clarus","Silver-spotted Skipper",Iowa,Jasper,2017-08-08,10:55,"Neal Smith National Wildlife Refuge",41.56153,-93.276552,IBSN,adult,Sighting,Sighting,1,77,,,Calm,,,Clear,,
254745,,,,"Epargyreus clarus","Silver-spotted Skipper",Iowa,Jasper,2019-08-04,9:20,"Neal Smith National Wildlife Refuge",41.56153,-93.276552,IBSN,adult,Sighting,Sighting,1,76,,,"Moderately Windy",,,Clear,,
284199,,,,"Epargyreus clarus","Silver-spotted Skipper",Iowa,Jasper,2020-06-12,,"Neal Smith National Wildlife Refuge",41.558756,-93.279723,IBSN,adult,Sighting,Sighting,3,79,,,"Relatively Still",,,Clear,,
304171,,,,"Epargyreus clarus","Silver-spotted Skipper",Iowa,Jasper,2021-06-09,10:00,"Neal Smith National Wildlife Refuge",41.559984,-93.279044,IBSN,adult,Sighting,Sighting,4,84,,,,,,"Partly Cloudy",,
327768,,,,"Epargyreus clarus","Silver-spotted Skipper",Iowa,Jasper,2022-06-07,,"Neal Smith National Wildlife Refuge",41.558683,-93.280422,IBSN,adult,Sighting,Sighting,1,68,,,"Moderately Windy",,,Clear,,
327769,,,,"Epargyreus clarus","Silver-spotted Skipper",Iowa,Jasper,2022-06-27,,"Neal Smith National Wildlife Refuge",41.558683,-93.280422,IBSN,adult,Sighting,Sighting,1,74,,,"Relatively Still",,,Clear,,
327770,,,,"Epargyreus clarus","Silver-spotted Skipper",Iowa,Jasper,2022-07-26,,"Neal Smith National Wildlife Refuge",41.558683,-93.280422,IBSN,adult,Sighting,Sighting,1,74,,,"Moderately Windy",,,"Partly Cloudy",,
346346,,,,"Epargyreus clarus","Silver-spotted Skipper",Iowa,Jasper,2023-07-15,,"Hartley Heritage Fen",41.76187,-93.346514,"Jay Gilliam",adult,Sighting,Photograph,2,,,,,,,,,8334
364270,,,,"Epargyreus clarus","Silver-spotted Skipper",Iowa,Jasper,2023-07-15,,"Neal Smith National Wildlife Refuge",41.56153,-93.276552,IBSN,adult,Sighting,Sighting,1,,,,"Relatively Still",,,Hazy,,
