ID,"Collection / Source","Catalog Number","Specify Number",Taxon,"Common Name",State,County,Date,Time,Locale,Latitude,Longitude,Collector,"Life Stage","Collection Method","Preparation Type",Count,Temperature,Humidity,"Dew Point",Wind,"Wind Direction","Barometric Pressure",Sky,"Moon Phase",Notes
137235,,2016-001777,,"Larinioides cornutus","Furrow Orbweaver",Iowa,Johnson,2009-07-11,,"Iowa City Site 1",41.62806,-91.51417,"Mark Brown",adult,,Photograph,1,,,,,,,,,
137236,,2016-001778,,"Larinioides cornutus","Furrow Orbweaver",Iowa,Johnson,2011-03-21,,"Iowa City Site 1",41.62806,-91.51417,"Mark Brown",adult,,Photograph,1,,,,,,,,,
137670,,2016-002214,,"Larinioides cornutus","Furrow Orbweaver",Iowa,Johnson,2011-07-14,,"Iowa City Site 1",41.62806,-91.51417,"Mark Brown",adult,,Photograph,1,,,,,,,,,
332580,,,,"Larinioides cornutus","Furrow Orbweaver",Iowa,Johnson,2022-09-19,06:12:00,"MacBride Nature Recreation Area",41.786914743333334,-91.56851765,"Mark Brown",adult,Sighting,Photograph,1,,,,,,,,,
332639,,,,"Larinioides cornutus","Furrow Orbweaver",Iowa,Johnson,2022-09-17,06:14:41,"MacBride Nature Recreation Area",41.78690624833333,-91.56850041333334,"Mark Brown",adult,Sighting,Photograph,1,,,,,,,,,
332823,,,,"Larinioides cornutus","Furrow Orbweaver",Iowa,Johnson,2022-08-22,06:18:49,"MacBride Nature Recreation Area",41.78690624833333,-91.56850041333334,"Mark Brown",adult,Sighting,Photograph,1,,,,,,,,,
332844,,,,"Larinioides cornutus","Furrow Orbweaver",Iowa,Johnson,2022-08-16,06:18:31,"MacBride Nature Recreation Area",41.78690624833333,-91.56850041333334,"Mark Brown",adult,Sighting,Photograph,1,,,,,,,,,
339609,,,,"Larinioides cornutus","Furrow Orbweaver",Iowa,Johnson,2023-08-11,,"Iowa City",41.674239,-91.5764,"Nic R",adult,Sighting,Photograph,2,,,,,,,,,
