ID,"Collection / Source","Catalog Number","Specify Number",Taxon,"Common Name",State,County,Date,Time,Locale,Latitude,Longitude,Collector,"Life Stage","Collection Method","Preparation Type",Count,Temperature,Humidity,"Dew Point",Wind,"Wind Direction","Barometric Pressure",Sky,"Moon Phase",Notes
4714,,2014-004995,,"Pholisora catullus","Common Sootywing",Iowa,Jones,1950-08-01,,"Jones County",42.151672,-91.1353," USGS - NPWRC",adult,Sighting,Sighting,1,,,,,,,,,"HIstorical Record"
41772,"Jim Durbin Drawer 024",2014-042149,SPM001814,"Pholisora catullus","Common Sootywing",Iowa,Jones,2001-04-29,,"Westphal Timber, Jones",42.1349,-90.95348,"Jim Durbin",adult,Net,Pinned,1,,,,,,,,,
108825,,2014-059992,,"Pholisora catullus","Common Sootywing",Iowa,Jones,2012-08-15,,"Hamilton and Tapken Prairie Preserve",42.1775,-90.9975,"Frank Olsen",,Sighting,Sighting,1,,,,,,,,,
108826,,2014-059993,,"Pholisora catullus","Common Sootywing",Iowa,Jones,2013-06-08,,"Hamilton and Tapken Prairie Preserve",42.1775,-90.9975,"Frank Olsen",,Sighting,Sighting,1,,,,,,,,,
117236,,2015-007794,,"Pholisora catullus","Common Sootywing",Iowa,Jones,2001-07-04,,"Muskrat Slough Wildlife Area",41.995104,-91.210021,"Chris Edwards",adult,Sighting,Sighting,2,,,,,,,,,
117243,,2015-007801,,"Pholisora catullus","Common Sootywing",Iowa,Jones,2002-08-17,,"Beam's Woods",42.142425,-91.343915,"Chris Edwards",adult,Sighting,Sighting,2,,,,,,,,,
208860,,2018-007043,,"Pholisora catullus","Common Sootywing",Iowa,Jones,2017-07-15,1345,"Westphal Timber, Jones",42.1349,-90.95348,"Anita Westphal",adult,Sighting,Sighting,9,80,,,2,,,"Mostly Clear",,"Woodland Edge,Field Road,Woodland Edge,Field Road,Woodland Edge"
240077,,2019-009757,,"Pholisora catullus","Common Sootywing",Iowa,Jones,2001-04-09,,"Westphal Timber, Jones",42.1349,-90.95348,"Jim Durbin",adult,Sighting,Pinned,1,,,,,,,,,
258758,,,,"Pholisora catullus","Common Sootywing",Iowa,Jones,2017-07-15,13:45,"Westphal Timber, Jones",42.1349,-90.95348,IBSN,adult,Sighting,Sighting,9,80,,,"Relatively Still",,,"Mostly Clear",,
