ID,"Collection / Source","Catalog Number","Specify Number",Taxon,"Common Name",State,County,Date,Time,Locale,Latitude,Longitude,Collector,"Life Stage","Collection Method","Preparation Type",Count,Temperature,Humidity,"Dew Point",Wind,"Wind Direction","Barometric Pressure",Sky,"Moon Phase",Notes
119999,,2015-010557,,"Vanessa cardui","Painted Lady",Iowa,Jones,2000-08-06,,"Muskrat Slough Wildlife Area",41.995104,-91.210021,"Chris Edwards",adult,Sighting,Sighting,3,,,,,,,,,
120000,,2015-010558,,"Vanessa cardui","Painted Lady",Iowa,Jones,2001-07-04,,"Muskrat Slough Wildlife Area",41.995104,-91.210021,"Chris Edwards",adult,Sighting,Sighting,2,,,,,,,,,
120001,,2015-010559,,"Vanessa cardui","Painted Lady",Iowa,Jones,2009-06-09,,"Hale Wildlife Area",42.020293,-91.035895,"Chris Edwards",adult,Sighting,Sighting,2,,,,,,,,,
120012,,2015-010570,,"Vanessa cardui","Painted Lady",Iowa,Jones,2003-08-31,,"Beam's Woods",42.142425,-91.343915,"Chris Edwards",adult,Sighting,Sighting,1,,,,,,,,,
120013,,2015-010571,,"Vanessa cardui","Painted Lady",Iowa,Jones,2003-09-14,,"Beam's Woods",42.142425,-91.343915,"Chris Edwards",adult,Sighting,Sighting,10,,,,,,,,,
127768,,2015-018358,,"Vanessa cardui","Painted Lady",Iowa,Jones,2015-06-17,,"Westphal Timber, Jones",42.1349,-90.95348,"Jeff Westphal",adult,Sighting,Sighting,1,,,,,,,,,
127786,,2015-018376,,"Vanessa cardui","Painted Lady",Iowa,Jones,2015-06-27,,"Westphal Timber, Jones",42.1349,-90.95348,"Jeff Westphal",adult,Sighting,Sighting,1,,,,,,,,,
168724,,2016-033469,,"Vanessa cardui","Painted Lady",Iowa,Jones,2016-06-06,,"Westphal Timber, Jones",42.1349,-90.95348,"Anita Westphal",adult,Sighting,Sighting,1,,,,,,,,,
199891,,2017-017668,,"Vanessa cardui","Painted Lady",Iowa,Jones,2017-08-11,,"Whitewater Canyon Wildlife Management Area",42.294543,-90.90167,"Frank Olsen",adult,Sighting,Sighting,1,73,,,6,0,," mostly cloudy",,
203195,,2018-000865,,"Vanessa cardui","Painted Lady",Iowa,Jones,2017-04-15,,"Beam's Woods",42.142425,-91.343915,"Chris Edwards",adult,Sighting,Sighting,1,,,,,,,,,
208882,,2018-007007,,"Vanessa cardui","Painted Lady",Iowa,Jones,2017-05-31,1305,"Westphal Timber, Jones",42.1349,-90.95348,"Anita Westphal",adult,Sighting,Sighting,3,73,,,7,,,Overcast,,"Woodland Edge,Field Road,Woodland Edge,Field Road,Woodland Edge"
208883,,2018-007021,,"Vanessa cardui","Painted Lady",Iowa,Jones,2017-06-18,1230,"Westphal Timber, Jones",42.1349,-90.95348,"Anita Westphal",adult,Sighting,Sighting,2,75,,,7,,,"Partly Cloudy",,"Woodland Edge,Field Road,Woodland Edge,Field Road,Woodland Edge"
208884,,2018-007038,,"Vanessa cardui","Painted Lady",Iowa,Jones,2017-07-15,1345,"Westphal Timber, Jones",42.1349,-90.95348,"Anita Westphal",adult,Sighting,Sighting,1,80,,,2,,,"Mostly Clear",,"Woodland Edge,Field Road,Woodland Edge,Field Road,Woodland Edge"
248604,,,,"Vanessa cardui","Painted Lady",Iowa,Jones,2019-04-19,,"Beam's Woods",42.142425,-91.343915,"Chris Edwards",adult,Sighting,Sighting,1,,,,,,,,,
263697,,,,"Vanessa cardui","Painted Lady",Iowa,Jones,2017-05-31,13:00,"Westphal Timber, Jones",42.1349,-90.95348,IBSN,adult,Sighting,Sighting,3,73,,,"Moderately Windy",,,Overcast,,
263698,,,,"Vanessa cardui","Painted Lady",Iowa,Jones,2017-06-18,12:30,"Westphal Timber, Jones",42.1349,-90.95348,IBSN,adult,Sighting,Sighting,2,75,,,"Moderately Windy",,,"Partly Cloudy",,
263699,,,,"Vanessa cardui","Painted Lady",Iowa,Jones,2017-07-15,13:45,"Westphal Timber, Jones",42.1349,-90.95348,IBSN,adult,Sighting,Sighting,1,80,,,"Relatively Still",,,"Mostly Clear",,
