ID,"Collection / Source","Catalog Number","Specify Number",Taxon,"Common Name",State,County,Date,Time,Locale,Latitude,Longitude,Collector,"Life Stage","Collection Method","Preparation Type",Count,Temperature,Humidity,"Dew Point",Wind,"Wind Direction","Barometric Pressure",Sky,"Moon Phase",Notes
11333,,2014-011615,SPM031471,"Bucculatrix pomifoliella",None,Iowa,Linn,2012-08-24,,"Wanatee County Park",42.0094,-91.56623,"Jim Durbin",adult,Blacklight/Fluorescent,Photograph,1,,,,,,,,,
17913,,2014-018213,SPM030316,"Bucculatrix coronatella",None,Iowa,Linn,2012-07-12,,"Wanatee County Park",42.0094,-91.56623,"Jim Durbin",adult,Blacklight/Fluorescent,Photograph,1,,,,,,,,,
17914,,2014-018214,SPM030383,"Bucculatrix coronatella",None,Iowa,Linn,2012-07-12,,"Wanatee County Park",42.0094,-91.56623,"Jim Durbin",adult,Blacklight/Fluorescent,Photograph,1,,,,,,,,,
17915,,2014-018215,SPM028015,"Bucculatrix angustata",None,Iowa,Linn,2012-06-05,,"Wanatee County Park",42.01026,-91.57381,"Jim Durbin",adult,Blacklight/Fluorescent,Photograph,1,,,,,,,,,
17917,"Jim Durbin Drawer 002",2014-018217,SPM026728,"Bucculatrix coronatella",None,Iowa,Linn,2012-05-06,,"Matsell Bridge Natural Area",42.13131,-91.38886,"Jim Durbin",adult,Blacklight/Fluorescent,Pinned,1,,,,,,,,,
17918,"Jim Durbin Drawer 002",2014-018218,SPM026729,"Bucculatrix coronatella",None,Iowa,Linn,2012-05-06,,"Matsell Bridge Natural Area",42.13131,-91.38886,"Jim Durbin",adult,Blacklight/Fluorescent,Pinned,1,,,,,,,,,
17919,"Jim Durbin Drawer 002",2014-018219,SPM027153,"Bucculatrix coronatella",None,Iowa,Linn,2012-05-18,,"Matsell Bridge Natural Area",42.13131,-91.38886,"Jim Durbin",adult,Blacklight/Fluorescent,Pinned,1,,,,,,,,,
17925,,2014-018225,SPM026791,"Bucculatrix coronatella",None,Iowa,Linn,2012-05-06,,"Matsell Bridge Natural Area",42.13131,-91.38886,"Jim Durbin",adult,Blacklight/Fluorescent,Photograph,1,,,,,,,,,
126400,,2015-016968,,"Bucculatrix canadensisella","Birch Skeletonizer Moth",Iowa,Linn,2015-06-05,2100-2315,"Wanatee County Park",42.01026,-91.57381,"Jim Durbin",adult,Blacklight/Fluorescent,Photograph,1,78,79,58,16,90,30.1,clear,"90% Moon visible",
130133,,2015-020723,,"Bucculatrix coronatella",None,Iowa,Linn,2015-09-03,,"Matsell Bridge Natural Area",42.131959,-91.388307,"Jim Durbin",adult,Blacklight/Fluorescent,Photograph,1,79,91,75,0,0,29.87,"partly cloudy","70% visible",
167056,,2016-031801,,"Bucculatrix pomifoliella",None,Iowa,Linn,2016-05-19,,"Hitaga Sand Ridge Prairie Preserve",42.250957,-91.632098,"Jim Durbin",adult,Blacklight/Florescent,Photograph,1,59,63,46,0,110,30.06,Clear,"95% visible",
167065,,2016-031810,,"Bucculatrix pomifoliella",None,Iowa,Linn,2016-05-19,,"Hitaga Sand Ridge Prairie Preserve",42.250957,-91.632098,"Jim Durbin",adult,Blacklight/Florescent,Photograph,1,59,63,46,0,110,30.06,Clear,"95% visible",
169557,,2016-034302,,"Bucculatrix pomifoliella",None,Iowa,Linn,2016-06-15,2100-2315,"Hitaga Sand Ridge Prairie Preserve",42.250957,-91.632098,"Jim Durbin",adult,Blacklight/Fluorescent,Photograph,1,83,56,66,8,310,29.74,clear,"90% visible",
171331,,2016-036076,,"Bucculatrix pomifoliella",None,Iowa,Linn,2016-07-01,2100-2300,"Vecny Woods",41.956725,-91.600854,"Jim Durbin",adult,Blacklight/Fluorescent,Photograph,1,68,63,55,0,0,30.07,"partly cloudy",dark,"heavy dew"
171610,,2016-036355,,"Bucculatrix pomifoliella",None,Iowa,Linn,2016-07-09,2100-2330,"Hitaga Sand Ridge Prairie Preserve",42.250957,-91.632098,"Jim Durbin",adult,Blacklight/Fluorescent,Photograph,1,72,83,66,0,0,30.01,clear,"30% visible",
172161,,2016-036906,,"Bucculatrix pomifoliella",None,Iowa,Linn,2016-07-20,2100-2330,"Hitaga Sand Ridge Prairie Preserve",42.250957,-91.632098,"Jim Durbin",adult,Blacklight/Fluorescent,Photograph,1,81,90,77,5,180,30.01,cloudy,full,
172746,,2016-037491,,"Bucculatrix pomifoliella",None,Iowa,Linn,2016-07-24,,"Hitaga Sand Ridge Prairie Preserve",42.250957,-91.632098,"Jim Durbin",adult,Blacklight/Fluorescent,Photograph,1,77,70,66,,300,29.9,"partly cloudy","90% visible",
172749,,2016-037494,,"Bucculatrix pomifoliella",None,Iowa,Linn,2016-07-24,,"Hitaga Sand Ridge Prairie Preserve",42.250957,-91.632098,"Jim Durbin",adult,Blacklight/Fluorescent,Photograph,1,77,70,66,,300,29.9,"partly cloudy","90% visible",
172767,,2016-037512,,"Bucculatrix pomifoliella",None,Iowa,Linn,2016-07-24,,"Hitaga Sand Ridge Prairie Preserve",42.250957,-91.632098,"Jim Durbin",adult,Blacklight/Fluorescent,Photograph,1,77,70,66,,300,29.9,"partly cloudy","90% visible",
175154,,2016-039904,,"Bucculatrix pomifoliella",None,Iowa,Linn,2016-08-28,2000-2230,"Hitaga Sand Ridge Prairie Preserve",42.250957,-91.632098,"Jim Durbin",adult,Blacklight/Fluorescent,Photograph,1,74,83,74,9,110,30.1,cloudy,"10% visible","Rained for about 15 minutes at 8:00PM"
191981,,2017-009942,,"Bucculatrix pomifoliella",None,Iowa,Linn,2017-05-31,2030-2300,"Hitaga Sand Ridge Prairie Preserve",42.250957,-91.632098,"Jim Durbin",adult,Blacklight/Fluorescent,Photograph,1,65,43,42,5,0,29.98,clear,"40% visible",
193032,,2017-010997,,"Bucculatrix inusitata",None,Iowa,Linn,2017-07-01,,"Hitaga Sand Ridge Prairie Preserve",42.250957,-91.632098,"Jim Durbin",adult,Blacklight/Fluorescent,Photograph,1,72,56,55,280,9,29.97,clear,,
193744,,2017-011734,,"Bucculatrix pomifoliella",None,Iowa,Linn,2014-07-13,2045-2330,"Hitaga Sand Ridge Prairie Preserve",42.250957,-91.632098,"Jim Durbin",adult,Blacklight/Fluorescent,Photograph,1,74,67,63,3,300,,"partly cloudy",,
200388,,2017-018320,,"Bucculatrix pomifoliella",None,Iowa,Linn,2016-07-24,,"Hitaga Sand Ridge Prairie Preserve",42.250957,-91.632098,"Don F. Becker",adult,,Photograph,1,,,,,,,,,
210103,"Jim Durbin Drawer 002",2018-008260,,"Bucculatrix angustata",None,Iowa,Linn,2018-05-09,"2030 to 2300","Hitaga Sand Ridge Prairie Preserve",42.250957,-91.632098,"Jim Durbin",adult,Blacklight/Fluorescent,Pinned,1,66,75,58,6,275,29.78,clear,"50 % visible",
211260,,2018-009417,,"Bucculatrix inusitata",None,Iowa,Linn,2018-05-30,"2045 - 2315","Hitaga Sand Ridge Prairie Preserve",42.25095,-91.63209,"Jim Durbin",adult,Blacklight/Fluorescent,Photograph,1,77,56,60,7,270,29.59,"partly cloudy",full,
214290,,2018-012446,,"Bucculatrix pomifoliella",None,Iowa,Linn,2018-07-09,2100-2330,"Hitaga Sand Ridge Prairie Preserve",42.250957,-91.632098,"Jim Durbin",adult,Blacklight/Fluorescent,Photograph,1,80,79,73,0,0,30.11,clear,"20% visible",
214518,,2018-012674,,"Bucculatrix pomifoliella",None,Iowa,Linn,2018-07-09,2100-2330,"Hitaga Sand Ridge Prairie Preserve",42.250957,-91.632098,"Jim Durbin",adult,Blacklight/Fluorescent,Photograph,1,80,79,73,0,0,30.11,clear,"20% visible",
214520,,2018-012676,,"Bucculatrix pomifoliella",None,Iowa,Linn,2018-07-09,2100-2330,"Hitaga Sand Ridge Prairie Preserve",42.250957,-91.632098,"Jim Durbin",adult,Blacklight/Fluorescent,Photograph,1,80,79,73,0,0,30.11,clear,"20% visible",
230348,,2019-005062,,"Bucculatrix adelpha",None,Iowa,Linn,2019-05-25,2100-2315,"Hitaga Sand Ridge Prairie Preserve",42.250957,-91.632098,"Jim Durbin",adult,Blacklight/Fluorescent,Photograph,1,75,68,64,1,180,29.82,clear,"80% visible",
233407,,2019-008119,,"Bucculatrix solidaginiella",None,Iowa,Linn,2019-07-07,2100-2315,"Hitaga Sand Ridge Prairie Preserve",42.250957,-91.632098,"Jim Durbin",adult,Blacklight/Fluorescent,Photograph,1,72,59,62,2,90,29.84,"parthly cloudy","10 % visible",
235236,,,,"Bucculatrix pomifoliella",None,Iowa,Linn,2019-08-02,2100-2315,"Hitaga Sand Ridge Prairie Preserve",42.251284,-91.630087,"Jim Durbin",adult,Sighting,Photograph,1,70,67,58,1,90,30.02,clar,dark,
265075,,,,"Bucculatrix coronatella",None,Iowa,Linn,2020-05-27,21:31:32,"Matsell Bridge Natural Area",42.13204088,-91.38537304,"Jim Durbin",adult,Blacklight/Fluorescent,Photograph,1,73,94,72,0,280,29.89,cloudy,"10% visible",
265077,,,,"Bucculatrix adelpha",None,Iowa,Linn,2020-05-27,21:31:32,"Matsell Bridge Natural Area",42.13204088,-91.38537304,"Jim Durbin",adult,Blacklight/Fluorescent,Photograph,1,73,94,72,0,280,29.89,cloudy,"10% visible",
269278,,,,"Bucculatrix ainsliella","Oak Skeletonizer Moth",Iowa,Linn,2020-06-12,20:48:25,"Hitaga Sand Ridge Prairie Preserve",42.250917,-91.632103,"Jim Durbin",adult,Sighting,Photograph,1,,,,,,,,,
271480,,,,"Bucculatrix coronatella",None,Iowa,Linn,2020-09-14,20:47:16,"Wickiup Hill Outdoor Learning Area",42.08735192,-91.76707176,"Jim Durbin",adult,Blacklight/Fluorescent,Photograph,1,71,68,60,3,100,29.65,cloudy,"10% visible",
289483,,,,"Bucculatrix angustata",None,Iowa,Linn,2021-06-27,21:22:26,"Pleasant Creek State Recreation Area, Linn County",42.1102396,-91.82752613,"Jim Durbin",adult,Sighting,Photograph,1,74,70,64,0,165,29.92,clear,"90% visible",
290409,,,,"Bucculatrix pomifoliella",None,Iowa,Linn,2021-07-08,22:19:21,"Hitaga Sand Ridge Prairie Preserve",42.25145774,-91.63021403,"Jim Durbin",adult,Blacklight/Fluorescent,Photograph,1,69,73,60,5,90,29.89,"partly cloudy","5% visible",
291800,,,,"Bucculatrix pomifoliella",None,Iowa,Linn,2021-08-11,21:17:14,"Pleasant Creek State Recreation Area, Linn County",42.11043641,-91.82716239,"Jim Durbin",adult,Blacklight/Fluorescent,Photograph,1,84,66,72,6,270,29.66,"partly cloudy","10% visible",
311557,,,,"Bucculatrix pomifoliella",None,Iowa,Linn,2022-07-02,21:00:22,"Wanatee County Park",42.01013441,-91.56662262,"Jim Durbin",adult,Blacklight/Fluorescent,Photograph,1,72,61,58,3,190,30.02,clear,"10% moon",
336588,,,,"Bucculatrix pomifoliella",None,Iowa,Linn,2023-07-03,22:16:47,"Hitaga Sand Ridge Prairie Preserve",42.250717995,-91.632138603333,"Jim Durbin",adult,Blacklight/Fluorescent,Photograph,1,80,77,72,0,0,29.92,clear,"full moon",
337162,,,,"Bucculatrix coronatella",None,Iowa,Linn,2023-07-08,21:56:53,"Palisades Kepler State Park",41.90829802,-91.50242489,"Jim Durbin",adult,Blacklight/Fluorescent,Photograph,1,73,55,53,7,330,29.89,clear,"80% visible",
337188,,,,"Bucculatrix coronatella",None,Iowa,Linn,2023-07-08,22:14:59,"Palisades Kepler State Park",41.90829802,-91.50242489,"Jim Durbin",adult,Blacklight/Fluorescent,Photograph,1,73,55,53,7,330,29.89,clear,"80% visible",
337844,,,,"Bucculatrix coronatella",None,Iowa,Linn,2023-07-16,22:10:46,"Matsell Bridge Natural Area",42.13217249,-91.38522877,"Jim Durbin",adult,Blacklight/Fluorescent,Photograph,1,73,70,63,4,220,29.87,cloudy,"10% visible",
339527,,,,"Bucculatrix montana",None,Iowa,Linn,2023-08-09,22:29:07,"Palisades Kepler State Park",41.90832623,-91.50233083,"Jim Durbin",adult,Blacklight/Fluorescent,Photograph,1,73,85,68,0,0,29.78,clear,"50% visible",
