ID,"Collection / Source","Catalog Number","Specify Number",Taxon,"Common Name",State,County,Date,Time,Locale,Latitude,Longitude,Collector,"Life Stage","Collection Method","Preparation Type",Count,Temperature,Humidity,"Dew Point",Wind,"Wind Direction","Barometric Pressure",Sky,"Moon Phase",Notes
11684,,2014-011966,SPM040508,"Anageshna primordialis","Yellow-spotted Webworm Moth",Iowa,Linn,2014-06-13,,"Pleasant Creek State Recreation Area, Linn County",42.10948,-91.8249,"Jim Durbin",adult,Blacklight/Fluorescent,Photograph,1,,,,,,,,,
11692,,2014-011974,SPM040526,"Anageshna primordialis","Yellow-spotted Webworm Moth",Iowa,Linn,2014-06-13,,"Pleasant Creek State Recreation Area, Linn County",42.10948,-91.8249,"Jim Durbin",adult,Blacklight/Fluorescent,Photograph,1,,,,,,,,,
11743,,2014-012025,SPM040694,"Anageshna primordialis","Yellow-spotted Webworm Moth",Iowa,Linn,2014-06-17,,"Pleasant Creek State Recreation Area, Linn County",42.10948,-91.8249,"Jim Durbin",adult,Blacklight/Fluorescent,Photograph,1,,,,,,,,,
11864,,2014-012146,SPM041058,"Anageshna primordialis","Yellow-spotted Webworm Moth",Iowa,Linn,2014-06-17,,"Pleasant Creek State Recreation Area, Linn County",42.10948,-91.8249,"Jim Durbin",adult,Blacklight/Fluorescent,Photograph,1,,,,,,,,,
15013,"Jim Durbin Drawer 041",2014-015309,SPM028438,"Anageshna primordialis","Yellow-spotted Webworm Moth",Iowa,Linn,2012-06-15,,"Matsell Bridge Natural Area",42.13131,-91.38886,"Jim Durbin",adult,Blacklight/Fluorescent,Pinned,1,,,,,,,,,
15014,,2014-015310,SPM029283,"Anageshna primordialis","Yellow-spotted Webworm Moth",Iowa,Linn,2012-06-22,,"Behren's Pond Woodland State Preserve",42.118214,-91.754324,"Jim Durbin",adult,Blacklight/Fluorescent,Photograph,1,,,,,,,,,
15018,"Frank Olsen Drawer 47",2014-015314,SPM032277,"Anageshna primordialis","Yellow-spotted Webworm Moth",Iowa,Linn,2012-06-18,,"Rock Island Botanical State Preserve",42.02732,-91.72723,"Frank Olsen",adult,,Pinned,1,,,,,,,,,"Located at Iowa State"
15027,,2014-015323,SPM040373,"Anageshna primordialis","Yellow-spotted Webworm Moth",Iowa,Linn,2014-06-10,,"Pleasant Creek State Recreation Area, Linn County",42.10948,-91.8249,"Jim Durbin",adult,Blacklight/Fluorescent,Photograph,1,,,,,,,,,
30959,,2014-031331,SPM034814,"Anageshna primordialis","Yellow-spotted Webworm Moth",Iowa,Linn,2013-07-19,,"Pinicon Ridge Park",42.21028,-91.54417,"Jim Durbin",adult,Blacklight/Fluorescent,Photograph,1,,,,,,,,,
30965,,2014-031337,SPM036151,"Anageshna primordialis","Yellow-spotted Webworm Moth",Iowa,Linn,2013-08-21,,"Matsell Bridge Natural Area",42.13131,-91.38886,"Jim Durbin",adult,Blacklight/Fluorescent,Photograph,1,,,,,,,,,
129141,,2015-019731,,"Anageshna primordialis","Yellow-spotted Webworm Moth",Iowa,Linn,2015-08-03,"2045 - 2300","Matsell Bridge Natural Area",42.131959,-91.388307,"Jim Durbin",adult,Blacklight/Fluorescent,Photograph,1,72,78,58,5,270,29.92,Clear,"90% visible",
129985,,2015-020575,,"Anageshna primordialis","Yellow-spotted Webworm Moth",Iowa,Linn,2015-09-01,"2000 - 2230","Indian Creek Nature Center",41.968932,-91.586884,"Jim Durbin",adult,Blacklight/Fluorescent,Photograph,1,81,71,71,2,180,29.96,cloudy,"95% visible",
134157,,2015-024751,,"Anageshna primordialis","Yellow-spotted Webworm Moth",Iowa,Linn,2014-08-22,,"Pleasant Creek State Recreation Area, Linn County",42.110327,-91.822988,"Jim Durbin",adult,Blacklight/Fluorescent,Photograph,1,,,,,,,,,
172992,,2016-037737,,"Anageshna primordialis","Yellow-spotted Webworm Moth",Iowa,Linn,2016-07-27,2100-2300,"Matsell Bridge Natural Area",42.131959,-91.388307,"Jim Durbin",adult,Blacklight/Fluorescent,Photograph,1,85,52,66,5,145,29.88,"partly cloudy","50 % visible","Heavy dew"
192185,,2017-010146,,"Anageshna primordialis","Yellow-spotted Webworm Moth",Iowa,Linn,2017-06-03,2030-2330,"Wickiup Hill Outdoor Learning Area",42.087567,-91.767578,"Jim Durbin",adult,Blacklight/Fluorescent,Photograph,1,83,44,59,4,280,29.88,clear,"60% visible",
193300,,2017-011265,,"Anageshna primordialis","Yellow-spotted Webworm Moth",Iowa,Linn,2017-07-04,,"Wickiup Hill Outdoor Learning Area",42.087358,-91.767092,"Jim Durbin",adult,Blacklight/Fluorescent,Photograph,1,78,78,71,3,90,30.02,"partly cloudy","80% visible",
193373,,2017-011338,,"Anageshna primordialis","Yellow-spotted Webworm Moth",Iowa,Linn,2017-07-04,,"Wickiup Hill Outdoor Learning Area",42.087358,-91.767092,"Jim Durbin",adult,Blacklight/Fluorescent,Photograph,1,78,78,71,3,90,30.02,"partly cloudy","80% visible",
193377,,2017-011342,,"Anageshna primordialis","Yellow-spotted Webworm Moth",Iowa,Linn,2017-07-04,,"Wickiup Hill Outdoor Learning Area",42.087358,-91.767092,"Jim Durbin",adult,Blacklight/Fluorescent,Photograph,1,78,78,71,3,90,30.02,"partly cloudy","80% visible",
193421,,2017-011386,,"Anageshna primordialis","Yellow-spotted Webworm Moth",Iowa,Linn,2017-07-04,,"Wickiup Hill Outdoor Learning Area",42.087358,-91.767092,"Jim Durbin",adult,Blacklight/Fluorescent,Photograph,1,78,78,71,3,90,30.02,"partly cloudy","80% visible",
212305,,2018-010461,,"Anageshna primordialis","Yellow-spotted Webworm Moth",Iowa,Linn,2018-06-15,2100-2315,"Wickiup Hill Outdoor Learning Area",42.087352,-91.767107,"Jim Durbin",adult,Blacklight/Florescent,Photograph,1,84,70,73,3,120,29.79,"partly cloudy","0 % visible",
212352,,2018-010508,,"Anageshna primordialis","Yellow-spotted Webworm Moth",Iowa,Linn,2018-06-15,2100-2315,"Wickiup Hill Outdoor Learning Area",42.087352,-91.767107,"Jim Durbin",adult,Blacklight/Florescent,Photograph,1,84,70,73,3,120,29.79,"partly cloudy","0 % visible",
216991,,2018-015147,,"Anageshna primordialis","Yellow-spotted Webworm Moth",Iowa,Linn,2018-08-01,"2045-2215. Quit early because of storms.","Wickiup Hill Outdoor Learning Area",42.087352,-91.767107,"Jim Durbin",adult,Blacklight/Fluorescent,Photograph,1,77,52,58,1,180,29.97,cloudy,"95% visible",
217005,,2018-015161,,"Anageshna primordialis","Yellow-spotted Webworm Moth",Iowa,Linn,2018-08-01,"2045-2215. Quit early because of storms.","Wickiup Hill Outdoor Learning Area",42.087352,-91.767107,"Jim Durbin",adult,Blacklight/Fluorescent,Photograph,1,77,52,58,1,180,29.97,cloudy,"95% visible",
217071,,2018-015227,,"Anageshna primordialis","Yellow-spotted Webworm Moth",Iowa,Linn,2018-08-01,"2045-2215. Quit early because of storms.","Wickiup Hill Outdoor Learning Area",42.087352,-91.767107,"Jim Durbin",adult,Blacklight/Fluorescent,Photograph,1,77,52,58,1,180,29.97,cloudy,"95% visible",
218533,,2018-016689,,"Anageshna primordialis","Yellow-spotted Webworm Moth",Iowa,Linn,2018-08-11,2030-2300,"Hitaga Sand Ridge Prairie Preserve",42.250604,-91.629962,"Jim Durbin",adult,Blacklight/Fluorescent,Photograph,1,74,81,68,5,45,30.06,clear,dark,
231646,,2019-006359,,"Anageshna primordialis","Yellow-spotted Webworm Moth",Iowa,Linn,2019-06-14,,"Wickiup Hill Outdoor Learning Area",42.087352,-91.767107,"Jim Durbin",adult,Blacklight/Fluorescent,Photograph,1,68,64,55,5,170,29.64,cloudy,"10% visible",
231665,,2019-006378,,"Anageshna primordialis","Yellow-spotted Webworm Moth",Iowa,Linn,2019-06-14,,"Wickiup Hill Outdoor Learning Area",42.087352,-91.767107,"Jim Durbin",adult,Blacklight/Fluorescent,Photograph,1,68,64,55,5,170,29.64,cloudy,"10% visible",
231729,,2019-006442,,"Anageshna primordialis","Yellow-spotted Webworm Moth",Iowa,Linn,2019-06-14,,"Wickiup Hill Outdoor Learning Area",42.087352,-91.767107,"Jim Durbin",adult,Blacklight/Fluorescent,Photograph,1,68,64,55,5,170,29.64,cloudy,"10% visible",
231746,,2019-006459,,"Anageshna primordialis","Yellow-spotted Webworm Moth",Iowa,Linn,2019-06-14,,"Wickiup Hill Outdoor Learning Area",42.087352,-91.767107,"Jim Durbin",adult,Blacklight/Fluorescent,Photograph,1,68,64,55,5,170,29.64,cloudy,"10% visible",
231763,,2019-006476,,"Anageshna primordialis","Yellow-spotted Webworm Moth",Iowa,Linn,2019-06-14,,"Wickiup Hill Outdoor Learning Area",42.087352,-91.767107,"Jim Durbin",adult,Blacklight/Fluorescent,Photograph,1,68,64,55,5,170,29.64,cloudy,"10% visible",
235698,,,,"Anageshna primordialis","Yellow-spotted Webworm Moth",Iowa,Linn,2019-08-11,2030-2300,"Wickiup Hill Outdoor Learning Area",42.087343,-91.767109,"Jim Durbin",adult,Sighting,Photograph,1,75,90,72,4,90,29.81,"parthly cloudy","90% visible",
237439,,,,"Anageshna primordialis","Yellow-spotted Webworm Moth",Iowa,Linn,2019-08-29,2000-2300,"Vecny Woods",41.956725,-91.600854,"Jim Durbin",adult,Blacklight/Fluorescent,Photograph,1,75,41,50,9,270,29.8,"partly cloudy","0% visible",
238028,,,,"Anageshna primordialis","Yellow-spotted Webworm Moth",Iowa,Linn,2019-09-05,"2000 - 2300","Wickiup Hill Outdoor Learning Area",42.087352,-91.767107,"Jim Durbin",adult,Blacklight/Fluorescent,Photograph,1,72,71,62,3,100,29.81,clear,"50% visible",
265912,,,,"Anageshna primordialis","Yellow-spotted Webworm Moth",Iowa,Linn,2020-06-07,21:13:52,"Wickiup Hill Outdoor Learning Area",42.08736536,-91.76707659,"Jim Durbin",adult,Sighting,Photograph,1,81,49,60,4,170,29.77,clear,full,
265944,,,,"Anageshna primordialis","Yellow-spotted Webworm Moth",Iowa,Linn,2020-06-07,20:57:18,"Wickiup Hill Outdoor Learning Area",42.08736536,-91.76707659,"Jim Durbin",adult,Sighting,Photograph,1,81,49,60,4,170,29.77,clear,full,
269805,,,,"Anageshna primordialis","Yellow-spotted Webworm Moth",Iowa,Linn,2020-08-08,22:20:14,"Hitaga Sand Ridge Prairie Preserve",42.25088607,-91.63213435,"Jim Durbin",adult,Blacklight/Fluorescent,Photograph,1,78,81,71,7,180,30.02,clear,"80% visible",
288289,,,,"Anageshna primordialis","Yellow-spotted Webworm Moth",Iowa,Linn,2021-06-05,21:43:05,"Wickiup Hill Outdoor Learning Area",42.08732869,-91.76570843,"Jim Durbin",adult,Sighting,Photograph,1,,,,,,,,,
291226,,,,"Anageshna primordialis","Yellow-spotted Webworm Moth",Iowa,Linn,2021-08-06,22:17:23,"Hitaga Sand Ridge Prairie Preserve",42.25082292,-91.63215158,"Jim Durbin",adult,Blacklight/Fluorescent,Photograph,1,78,72,68,4,165,29.79,cloudy,"new moon",
335340,,,,"Anageshna primordialis","Yellow-spotted Webworm Moth",Iowa,Linn,2023-06-17,23:02:25,"Wanatee County Park",42.010114365,-91.566550498333,"Jim Durbin",adult,Blacklight/Fluorescent,Photograph,1,75,54,57,2,90,29.84,c;ear,"no moon",
336515,,,,"Anageshna primordialis","Yellow-spotted Webworm Moth",Iowa,Linn,2023-07-03,22:01:03,"Hitaga Sand Ridge Prairie Preserve",42.250717995,-91.632138603333,"Jim Durbin",adult,Blacklight/Fluorescent,Photograph,1,80,77,72,0,0,29.92,clear,"full moon",
339515,,,,"Anageshna primordialis","Yellow-spotted Webworm Moth",Iowa,Linn,2023-08-09,22:21:56,"Palisades Kepler State Park",41.90832623,-91.50233083,"Jim Durbin",adult,Blacklight/Fluorescent,Photograph,1,73,85,68,0,0,29.78,clear,"50% visible",
340434,,,,"Anageshna primordialis","Yellow-spotted Webworm Moth",Iowa,Linn,2023-08-20,21:45:18,"Pinicon Ridge Park",42.21852826,-91.53878734,"Jim Durbin",adult,Blacklight/Fluorescent,Photograph,1,87,73,77,2,360,30.09,"partly cloudy","10% visible",
