ID,"Collection / Source","Catalog Number","Specify Number",Taxon,"Common Name",State,County,Date,Time,Locale,Latitude,Longitude,Collector,"Life Stage","Collection Method","Preparation Type",Count,Temperature,Humidity,"Dew Point",Wind,"Wind Direction","Barometric Pressure",Sky,"Moon Phase",Notes
10434,,2014-010715,SPM000007,"Drepana arcuata","Arched Hooktip",Iowa,Linn,2003-07-09,,"1460 Douglas Ct, Marion",42.040069,-91.590953,"Jim Durbin",adult,Blacklight/Fluorescent,Sighting,1,,,,,,,,,
10435,,2014-010716,SPM000008,"Drepana arcuata","Arched Hooktip",Iowa,Linn,2003-07-09,,"1460 Douglas Ct, Marion",42.040069,-91.590953,"Jim Durbin",adult,Blacklight/Fluorescent,Sighting,1,,,,,,,,,
23921,,2014-024267,SPM031004,"Drepana arcuata","Arched Hooktip",Iowa,Linn,2012-07-27,,"Wanatee County Park",42.0094,-91.56623,"Jim Durbin",adult,Blacklight/Fluorescent,Pinned,1,,,,,,,,,
24120,"Frank Olsen Drawer 11",2014-024466,SPM002221,"Drepana arcuata","Arched Hooktip",Iowa,Linn,2004-08-17,,"Wickiup Hill Outdoor Learning Area",42.08398,-91.7651,"Frank Olsen",adult,,Pinned,1,,,,,,,,,"Located at Iowa State"
24121,"Frank Olsen Drawer 11",2014-024467,SPM002222,"Drepana arcuata","Arched Hooktip",Iowa,Linn,2004-08-26,,"Wickiup Hill Outdoor Learning Area",42.08398,-91.7651,"Frank Olsen",adult,,Pinned,1,,,,,,,,,"Located at Iowa State"
24123,"Frank Olsen Drawer 11",2014-024469,SPM003846,"Drepana arcuata","Arched Hooktip",Iowa,Linn,2004-05-19,,"Wickiup Hill Outdoor Learning Area",42.08398,-91.7651,"Frank Olsen",adult,,Pinned,1,,,,,,,,,"Located at Iowa State"
24124,"Frank Olsen Drawer 11",2014-024470,SPM003847,"Drepana arcuata","Arched Hooktip",Iowa,Linn,2004-06-26,,"Wickiup Hill Outdoor Learning Area",42.08398,-91.7651,"Frank Olsen",adult,,Pinned,1,,,,,,,,,"Located at Iowa State"
24125,"Frank Olsen Drawer 11",2014-024471,SPM003849,"Drepana arcuata","Arched Hooktip",Iowa,Linn,2004-08-08,,"Wickiup Hill Outdoor Learning Area",42.08398,-91.7651,"Frank Olsen",adult,,Pinned,1,,,,,,,,,"Located at Iowa State"
24127,"Jim Durbin Drawer 052",2014-024473,SPM004458,"Drepana arcuata","Arched Hooktip",Iowa,Linn,2005-06-18,,"Wickiup Hill Outdoor Learning Area",42.08398,-91.7651,"Jim Durbin",adult,Blacklight/Fluorescent,Pinned,1,,,,,,,,,
24128,"Jim Durbin Drawer 052",2014-024474,SPM004701,"Drepana arcuata","Arched Hooktip",Iowa,Linn,2005-07-03,,"Wickiup Hill Outdoor Learning Area",42.08398,-91.7651,"Jim Durbin",adult,Blacklight/Fluorescent,Pinned,1,,,,,,,,,
24129,"Jim Durbin Drawer 052",2014-024475,SPM004957,"Drepana arcuata","Arched Hooktip",Iowa,Linn,2005-07-01,,"Behren's Pond Woodland State Preserve",42.118214,-91.754324,"Jim Durbin",adult,Blacklight/Fluorescent,Pinned,1,,,,,,,,,
24130,"Frank Olsen Drawer 11",2014-024476,SPM005596,"Drepana arcuata","Arched Hooktip",Iowa,Linn,2005-06-29,,"Rock Island Botanical State Preserve",42.02732,-91.72723,"Frank Olsen",adult,,Pinned,1,,,,,,,,,"Located at Iowa State"
24131,"Frank Olsen Drawer 11",2014-024477,SPM005597,"Drepana arcuata","Arched Hooktip",Iowa,Linn,2005-06-29,,"Rock Island Botanical State Preserve",42.02732,-91.72723,"Frank Olsen",adult,,Pinned,1,,,,,,,,,"Located at Iowa State"
24136,"Jim Durbin Drawer 052",2014-024482,SPM009508,"Drepana arcuata","Arched Hooktip",Iowa,Linn,2007-09-05,,"Wickiup Hill Outdoor Learning Area",42.08398,-91.7651,"Jim Durbin",adult,Blacklight/Fluorescent,Pinned,1,,,,,,,,,
24137,"Jim Durbin Drawer 052",2014-024483,SPM009510,"Drepana arcuata","Arched Hooktip",Iowa,Linn,2007-09-05,,"Wickiup Hill Outdoor Learning Area",42.08398,-91.7651,"Jim Durbin",adult,Blacklight/Fluorescent,Pinned,1,,,,,,,,,
24141,"Jim Durbin Drawer 052",2014-024487,SPM012268,"Drepana arcuata","Arched Hooktip",Iowa,Linn,2008-08-15,,"Wickiup Hill Outdoor Learning Area",42.08398,-91.7651,"Jim Durbin",adult,Blacklight/Fluorescent,Pinned,1,,,,,,,,,
24142,"Frank Olsen Drawer 11",2014-024488,SPM012928,"Drepana arcuata","Arched Hooktip",Iowa,Linn,2008-05-05,,"Rock Island Botanical State Preserve",42.02732,-91.72723,"Frank Olsen",adult,,Pinned,1,,,,,,,,,"Located at Iowa State"
24143,"Frank Olsen Drawer 11",2014-024489,SPM012929,"Drepana arcuata","Arched Hooktip",Iowa,Linn,2008-05-05,,"Rock Island Botanical State Preserve",42.02732,-91.72723,"Frank Olsen",adult,,Pinned,1,,,,,,,,,"Located at Iowa State"
24144,"Frank Olsen Drawer 11",2014-024490,SPM016512,"Drepana arcuata","Arched Hooktip",Iowa,Linn,2009-09-10,,"Rock Island Botanical State Preserve",42.02732,-91.72723,"Frank Olsen",adult,,Pinned,1,,,,,,,,,"Located at Iowa State"
24147,"Jim Durbin Drawer 052",2014-024493,SPM019034,"Drepana arcuata","Arched Hooktip",Iowa,Linn,2010-07-31,,"Rock Island Botanical State Preserve",42.02732,-91.72723,"Tom Jantscher",adult,,Pinned,1,,,,,,,,,
24149,"Jim Durbin Drawer 052",2014-024495,SPM022049,"Drepana arcuata","Arched Hooktip",Iowa,Linn,2011-05-21,,"Rock Island Botanical State Preserve",42.02732,-91.72723,"Tom Jantscher",adult,,Pinned,1,,,,,,,,,
24150,,2014-024496,SPM022551,"Drepana arcuata","Arched Hooktip",Iowa,Linn,2011-06-27,,"Wickiup Hill Outdoor Learning Area",42.08398,-91.7651,"Jim Durbin",adult,Blacklight/Fluorescent,Photograph,1,,,,,,,,,
24153,"Frank Olsen Drawer 11",2014-024499,SPM024419,"Drepana arcuata","Arched Hooktip",Iowa,Linn,2011-08-15,,"Matsell Bridge Natural Area",42.13131,-91.38886,"Frank Olsen",adult,,Pinned,1,,,,,,,,,"Located at Iowa State"
24154,"Frank Olsen Drawer 11",2014-024500,SPM024535,"Drepana arcuata","Arched Hooktip",Iowa,Linn,2011-05-30,,"Rock Island Botanical State Preserve",42.02732,-91.72723,"Frank Olsen",adult,,Pinned,1,,,,,,,,,"Located at Iowa State"
24155,"Jim Durbin Drawer 052",2014-024501,SPM026288,"Drepana arcuata","Arched Hooktip",Iowa,Linn,2012-04-24,,"Matsell Bridge Natural Area",42.13131,-91.38886,"Jim Durbin",adult,Blacklight/Fluorescent,Pinned,1,,,,,,,,,
24156,,2014-024502,SPM028589,"Drepana arcuata","Arched Hooktip",Iowa,Linn,2012-06-15,,"Matsell Bridge Natural Area",42.13131,-91.38886,"Jim Durbin",adult,Blacklight/Fluorescent,Photograph,1,,,,,,,,,
24157,,2014-024503,SPM029184,"Drepana arcuata","Arched Hooktip",Iowa,Linn,2012-06-22,,"Behren's Pond Woodland State Preserve",42.118214,-91.754324,"Jim Durbin",adult,Blacklight/Fluorescent,Photograph,1,,,,,,,,,
24160,"Frank Olsen Drawer 11",2014-024506,SPM032289,"Drepana arcuata","Arched Hooktip",Iowa,Linn,2012-06-18,,"Rock Island Botanical State Preserve",42.02732,-91.72723,"Frank Olsen",adult,,Pinned,1,,,,,,,,,"Located at Iowa State"
122695,"Jim Durbin Drawer 052",2015-013262,,"Drepana arcuata","Arched Hooktip",Iowa,Linn,2015-05-07,,"Matsell Bridge Natural Area",42.131959,-91.388307,"Jim Durbin",adult,Blacklight/Fluorescent,Pinned,1,67,96,65,6,135,29.85,"25% Cloudy","Waning Gibbous",
122760,,2015-013327,,"Drepana arcuata","Arched Hooktip",Iowa,Linn,2015-05-07,,"Matsell Bridge Natural Area",42.131959,-91.388307,"Jim Durbin",adult,Blacklight/Fluorescent,Photograph,1,67,96,65,6,135,29.85,"25% Cloudy","Waning Gibbous",
122817,,2015-013384,,"Drepana arcuata","Arched Hooktip",Iowa,Linn,2015-05-07,,"Matsell Bridge Natural Area",42.131959,-91.388307,"Jim Durbin",adult,Blacklight/Fluorescent,Photograph,1,67,96,65,6,135,29.85,"25% Cloudy","Waning Gibbous",
122838,,2015-013405,,"Drepana arcuata","Arched Hooktip",Iowa,Linn,2015-05-07,,"Matsell Bridge Natural Area",42.131959,-91.388307,"Jim Durbin",adult,Blacklight/Fluorescent,Photograph,1,67,96,65,6,135,29.85,"25% Cloudy","Waning Gibbous",
122843,,2015-013410,,"Drepana arcuata","Arched Hooktip",Iowa,Linn,2015-05-07,,"Matsell Bridge Natural Area",42.131959,-91.388307,"Jim Durbin",adult,Blacklight/Fluorescent,Photograph,1,67,96,65,6,135,29.85,"25% Cloudy","Waning Gibbous",
123714,,2015-014281,,"Drepana arcuata","Arched Hooktip",Iowa,Linn,2015-05-13,,"Matsell Bridge Natural Area",42.131959,-91.388307,"Jim Durbin",adult,Blacklight/Fluorescent,Photograph,1,57,58,42,10,135,30.28,"20% Cloudy","20% visible",
127680,,2015-018270,,"Drepana arcuata","Arched Hooktip",Iowa,Linn,2015-06-23,,"Matsell Bridge Natural Area",42.131959,-91.388307,"Jim Durbin",adult,Blacklight/Fluorescent,Photograph,1,,,,,,,,,
128558,,2015-019148,,"Drepana arcuata","Arched Hooktip",Iowa,Linn,2015-07-26,"2100 to 2300","Matsell Bridge Natural Area",42.131959,-91.388307,"Jim Durbin",adult,Blacklight/Fluorescent,Photograph,1,75,95,73,2,160,29.92,"partly cloudy","60% visible",
129125,,2015-019715,,"Drepana arcuata","Arched Hooktip",Iowa,Linn,2015-08-03,"2045 - 2300","Matsell Bridge Natural Area",42.131959,-91.388307,"Jim Durbin",adult,Blacklight/Fluorescent,Photograph,1,72,78,58,5,270,29.92,Clear,"90% visible",
129197,,2015-019787,,"Drepana arcuata","Arched Hooktip",Iowa,Linn,2015-08-03,"2045 - 2300","Matsell Bridge Natural Area",42.131959,-91.388307,"Jim Durbin",adult,Blacklight/Fluorescent,Photograph,1,72,78,58,5,270,29.92,Clear,"90% visible",
129245,,2015-019835,,"Drepana arcuata","Arched Hooktip",Iowa,Linn,2015-08-03,"2045 - 2300","Matsell Bridge Natural Area",42.131959,-91.388307,"Jim Durbin",adult,Blacklight/Fluorescent,Photograph,1,72,78,58,5,270,29.92,Clear,"90% visible",
130070,,2015-020660,,"Drepana arcuata","Arched Hooktip",Iowa,Linn,2015-09-03,,"Matsell Bridge Natural Area",42.131959,-91.388307,"Jim Durbin",adult,Blacklight/Fluorescent,Photograph,1,79,91,75,0,0,29.87,"partly cloudy","70% visible",
132914,"Frank Olsen Drawer 11",2015-023508,,"Drepana arcuata","Arched Hooktip",Iowa,Linn,2015-08-21,,"Matsell Bridge Natural Area",42.131959,-91.388307,"Frank Olsen",adult,,Pinned,1,,,,,,,,,"Located at Iowa State"
167119,,2016-031864,,"Drepana arcuata","Arched Hooktip",Iowa,Linn,2016-05-23,2030-2300,"Matsell Bridge Natural Area",42.131126,-91.388999,"Jim Durbin",adult,Blacklight/Fluorescent,Photograph,1,74,42,50,7,130,29.82,clear,Full,
167156,,2016-031901,,"Drepana arcuata","Arched Hooktip",Iowa,Linn,2016-05-23,2030-2300,"Matsell Bridge Natural Area",42.131126,-91.388999,"Jim Durbin",adult,Blacklight/Florescent,Photograph,1,74,42,50,7,130,29.82,clear,Full,
167165,,2016-031910,,"Drepana arcuata","Arched Hooktip",Iowa,Linn,2016-05-23,2030-2300,"Matsell Bridge Natural Area",42.131126,-91.388999,"Jim Durbin",adult,Blacklight/Florescent,Photograph,1,74,42,50,7,130,29.82,clear,Full,
167175,,2016-031920,,"Drepana arcuata","Arched Hooktip",Iowa,Linn,2016-05-23,2030-2300,"Matsell Bridge Natural Area",42.131126,-91.388999,"Jim Durbin",adult,Blacklight/Florescent,Photograph,1,74,42,50,7,130,29.82,clear,Full,
167262,,2016-032007,,"Drepana arcuata","Arched Hooktip",Iowa,Linn,2016-05-23,2030-2300,"Matsell Bridge Natural Area",42.131126,-91.388999,"Jim Durbin",adult,Blacklight/Florescent,Photograph,1,74,42,50,7,130,29.82,clear,Full,
171576,,2016-036321,,"Drepana arcuata","Arched Hooktip",Iowa,Linn,2016-07-05,2100-2300,"Hitaga Sand Ridge Prairie Preserve",42.250957,-91.632098,"Jim Durbin",adult,Blacklight/Fluorescent,Photograph,1,80,88,75,4,150,29.76,cloudy,Dark,
173014,,2016-037759,,"Drepana arcuata","Arched Hooktip",Iowa,Linn,2016-07-27,2100-2300,"Matsell Bridge Natural Area",42.131959,-91.388307,"Jim Durbin",adult,Blacklight/Fluorescent,Photograph,1,85,52,66,5,145,29.88,"partly cloudy","50 % visible","Heavy dew"
173029,,2016-037774,,"Drepana arcuata","Arched Hooktip",Iowa,Linn,2016-07-27,2100-2300,"Matsell Bridge Natural Area",42.131959,-91.388307,"Jim Durbin",adult,Blacklight/Fluorescent,Photograph,1,85,52,66,5,145,29.88,"partly cloudy","50 % visible","Heavy dew"
173271,,2016-038017,,"Drepana arcuata","Arched Hooktip",Iowa,Linn,2016-07-30,2100-2330,"Hitaga Sand Ridge Prairie Preserve",42.250957,-91.632098,"Jim Durbin",adult,Blacklight/Fluorescent,Photograph,1,72,87,68,0,0,29.92,"partly cloudy","10% visible",
173621,,2016-038371,,"Drepana arcuata","Arched Hooktip",Iowa,Linn,2016-08-03,2100-2330,"Hitaga Sand Ridge Prairie Preserve",42.250957,-91.632098,"Jim Durbin",adult,Blacklight/Fluorescent,Photograph,1,81,74,71,3,180,29.96,clear,Dark,
173639,,2016-038389,,"Drepana arcuata","Arched Hooktip",Iowa,Linn,2016-08-03,2100-2330,"Hitaga Sand Ridge Prairie Preserve",42.250957,-91.632098,"Jim Durbin",adult,Blacklight/Fluorescent,Photograph,1,81,74,71,3,180,29.96,clear,Dark,
173671,,2016-038421,,"Drepana arcuata","Arched Hooktip",Iowa,Linn,2016-08-03,2100-2330,"Hitaga Sand Ridge Prairie Preserve",42.250957,-91.632098,"Jim Durbin",adult,Blacklight/Fluorescent,Photograph,1,81,74,71,3,180,29.96,clear,Dark,
173672,,2016-038422,,"Drepana arcuata","Arched Hooktip",Iowa,Linn,2016-08-03,2100-2330,"Hitaga Sand Ridge Prairie Preserve",42.250957,-91.632098,"Jim Durbin",adult,Blacklight/Fluorescent,Photograph,1,81,74,71,3,180,29.96,clear,Dark,
173673,,2016-038423,,"Drepana arcuata","Arched Hooktip",Iowa,Linn,2016-08-03,2100-2330,"Hitaga Sand Ridge Prairie Preserve",42.250957,-91.632098,"Jim Durbin",adult,Blacklight/Fluorescent,Photograph,1,81,74,71,3,180,29.96,clear,Dark,
174135,,2016-038890,,"Drepana arcuata","Arched Hooktip",Iowa,Linn,2016-08-09,2030-2300,"Hitaga Sand Ridge Prairie Preserve",42.250957,-91.632098,"Jim Durbin",adult,Blacklight/Fluorescent,Photograph,1,79,79,71,0,0,29.96,clear,"40% visible",
174704,,2016-039454,,"Drepana arcuata","Arched Hooktip",Iowa,Linn,2016-08-15,2030-2300,"Hitaga Sand Ridge Prairie Preserve",42.250957,-91.632098,"Jim Durbin",adult,Blacklight/Fluorescent,Photograph,1,75,74,66,0,0,29096,cloudy,full,
194803,,2017-012767,,"Drepana arcuata","Arched Hooktip",Iowa,Linn,2017-08-01,2045-2300,"Matsell Bridge Natural Area",42.131126,-91.388999,"Jim Durbin",adult,Blacklight/Fluorescent,Photograph,1,83,91,57,5,210,30.03,cloudy,"50% visible",
194811,,2017-012775,,"Drepana arcuata","Arched Hooktip",Iowa,Linn,2017-08-01,2045-2300,"Matsell Bridge Natural Area",42.131126,-91.388999,"Jim Durbin",adult,Blacklight/Fluorescent,Photograph,1,83,91,57,5,210,30.03,cloudy,"50% visible",
194818,,2017-012782,,"Drepana arcuata","Arched Hooktip",Iowa,Linn,2017-08-01,2045-2300,"Matsell Bridge Natural Area",42.131126,-91.388999,"Jim Durbin",adult,Blacklight/Fluorescent,Photograph,1,83,91,57,5,210,30.03,cloudy,"50% visible",
195559,,2017-013523,,"Drepana arcuata","Arched Hooktip",Iowa,Linn,2017-08-18,2030-2300,"Wickiup Hill Outdoor Learning Area",42.087567,-91.767578,"Jim Durbin",adult,Blacklight/Fluorescent,Photograph,1,71,73,62,5,10,29.88,clear,"20% visible",
199996,,2017-017927,,"Drepana arcuata","Arched Hooktip",Iowa,Linn,2016-06-21,,"Hitaga Sand Ridge Prairie Preserve",42.250957,-91.632098,"Don F. Becker",adult,,Photograph,1,,,,,,,,,
200025,,2017-017956,,"Drepana arcuata","Arched Hooktip",Iowa,Linn,2016-06-21,,"Hitaga Sand Ridge Prairie Preserve",42.250957,-91.632098,"Don F. Becker",adult,,Photograph,1,,,,,,,,,
200299,,2017-018230,,"Drepana arcuata","Arched Hooktip",Iowa,Linn,2016-08-09,,"Hitaga Sand Ridge Prairie Preserve",42.250957,-91.632098,"Don F. Becker",adult,,Photograph,1,,,,,,,,,
213340,,2018-011496,,"Drepana arcuata","Arched Hooktip",Iowa,Linn,2018-06-27,2100-2330,"Matsell Bridge Natural Area",42.132148,-91.385221,"Jim Durbin",adult,Blacklight/Fluorescent,Photograph,1,80,59,64,0,0,29.77,"partly cloudy",Full,"extremely heavy dew"
213460,,2018-011616,,"Drepana arcuata","Arched Hooktip",Iowa,Linn,2018-06-27,2100-2330,"Matsell Bridge Natural Area",42.132148,-91.385221,"Jim Durbin",adult,Blacklight/Fluorescent,Photograph,1,80,59,64,0,0,29.77,"partly cloudy",Full,"extremely heavy dew"
214696,,2018-012852,,"Drepana arcuata","Arched Hooktip",Iowa,Linn,2018-07-12,2100-2330,"Matsell Bridge Natural Area",42.132148,-91.385221,"Jim Durbin",adult,Blacklight/Fluorescent,Photograph,1,88,56,70,6,90,30.04,clear,"0 visible",
218645,,2018-016801,,"Drepana arcuata","Arched Hooktip",Iowa,Linn,2018-08-11,2030-2300,"Hitaga Sand Ridge Prairie Preserve",42.250604,-91.629962,"Jim Durbin",adult,Blacklight/Fluorescent,Photograph,1,74.0,81.0,68.0,5.0,45,30.06,clear,dark,
218959,,2018-017115,,"Drepana arcuata","Arched Hooktip",Iowa,Linn,2018-08-16,2030-2330,"Matsell Bridge Natural Area",42.132148,-91.385221,"Jim Durbin",adult,Blacklight/Fluorescent,Photograph,1,72,83,66,5,310,29.84,"partly cloudy","30% visible",
220325,,2018-018481,,"Drepana arcuata","Arched Hooktip",Iowa,Linn,2018-09-11,1945-2300,"Hitaga Sand Ridge Prairie Preserve",42.25095,-91.63209,"Jim Durbin",adult,Blacklight/Fluorescent,Photograph,1,73,64,60,2,110,30.02,clear,dark,
230343,,2019-005056,,"Drepana arcuata","Arched Hooktip",Iowa,Linn,2019-05-25,2100-2315,"Hitaga Sand Ridge Prairie Preserve",42.250957,-91.632098,"Jim Durbin",adult,Blacklight/Fluorescent,Photograph,1,75,68,64,1,180,29.82,clear,"80% visible",
232987,,2019-007700,,"Drepana arcuata","Arched Hooktip",Iowa,Linn,2019-06-29,2100-2345,"Wickiup Hill Outdoor Learning Area",42.0876,-91.76787,"Jim Durbin",adult,Blacklight/Fluorescent,Photograph,1,85,69,74,0,180,29.84,Clear,"10% visible",
233008,,2019-007721,,"Drepana arcuata","Arched Hooktip",Iowa,Linn,2019-06-29,2100-2345,"Wickiup Hill Outdoor Learning Area",42.0876,-91.76787,"Jim Durbin",adult,Blacklight/Fluorescent,Photograph,1,85,69,74,0,180,29.84,Clear,"10% visible",
233181,,2019-007974,,"Drepana arcuata","Arched Hooktip",Iowa,Linn,2019-07-04,2100-2315,"Wickiup Hill Outdoor Learning Area",42.086576,-91.766717,"Jim Durbin",adult,Blacklight/Fluorescent,Photograph,1,82,66,69,2,170,29.75,clear,new,
233228,,2019-008021,,"Drepana arcuata","Arched Hooktip",Iowa,Linn,2019-07-04,2100-2315,"Wickiup Hill Outdoor Learning Area",42.086576,-91.766717,"Jim Durbin",adult,Blacklight/Fluorescent,Photograph,1,82,66,69,2,170,29.75,clear,new,
235764,,,,"Drepana arcuata","Arched Hooktip",Iowa,Linn,2019-08-11,2030-2300,"Wickiup Hill Outdoor Learning Area",42.087343,-91.767109,"Jim Durbin",adult,Sighting,Photograph,1,75,90,72,4,90,29.81,"parthly cloudy","90% visible",
236086,,,,"Drepana arcuata","Arched Hooktip",Iowa,Linn,2019-08-14,2030-2300,"Hitaga Sand Ridge Prairie Preserve",42.250886,-91.632106,"Jim Durbin",adult,Sighting,Photograph,1,68,89,65,2,260,29.91,"partly cloidy",full,
236101,,,,"Drepana arcuata","Arched Hooktip",Iowa,Linn,2019-08-14,2030-2300,"Hitaga Sand Ridge Prairie Preserve",42.250886,-91.632106,"Jim Durbin",adult,Sighting,Photograph,1,68,89,65,2,260,29.91,"partly cloidy",full,
236313,,,,"Drepana arcuata","Arched Hooktip",Iowa,Linn,2019-08-17,2030-2300,"Hitaga Sand Ridge Prairie Preserve",42.25226,-91.63040167,"Jim Durbin",adult,Blacklight/Fluorescent,Photograph,1,79,62,65,1,180,29.71,"parthly cloudy","Full Moon",
236319,,,,"Drepana arcuata","Arched Hooktip",Iowa,Linn,2019-08-17,2030-2300,"Hitaga Sand Ridge Prairie Preserve",42.25226,-91.63040167,"Jim Durbin",adult,Blacklight/Fluorescent,Photograph,1,79,62,65,1,180,29.71,"parthly cloudy","Full Moon",
236406,,,,"Drepana arcuata","Arched Hooktip",Iowa,Linn,2019-08-17,2030-2300,"Hitaga Sand Ridge Prairie Preserve",42.25226,-91.63040167,"Jim Durbin",adult,Blacklight/Fluorescent,Photograph,1,79,62,65,1,180,29.71,"parthly cloudy","Full Moon",
236534,,,,"Drepana arcuata","Arched Hooktip",Iowa,Linn,2019-08-19,2030-2300,"Wickiup Hill Outdoor Learning Area",42.087352,-91.767107,"Jim Durbin",adult,Blacklight/Fluorescent,Photograph,1,74,81,68,2,90,29.88,"partly cloudy","90% visible",
236535,,,,"Drepana arcuata","Arched Hooktip",Iowa,Linn,2019-08-19,2030-2300,"Wickiup Hill Outdoor Learning Area",42.087352,-91.767107,"Jim Durbin",adult,Blacklight/Fluorescent,Photograph,1,74,81,68,2,90,29.88,"partly cloudy","90% visible",
237750,,,,"Drepana arcuata","Arched Hooktip",Iowa,Linn,2019-09-02,,"Matsell Bridge Natural Area",42.131959,-91.388307,"Jim Durbin",adult,Blacklight/Fluorescent,Photograph,1,77,77,67,4,135,29.85,"parthly cloudy","10% visible",
237769,,,,"Drepana arcuata","Arched Hooktip",Iowa,Linn,2019-09-02,2000-2300,"Matsell Bridge Natural Area",42.131959,-91.388307,"Jim Durbin",adult,Blacklight/Fluorescent,Photograph,1,77,77,67,4,135,29.85,"parthly cloudy","10% visible",
237784,,,,"Drepana arcuata","Arched Hooktip",Iowa,Linn,2019-09-02,2000-2300,"Matsell Bridge Natural Area",42.131959,-91.388307,"Jim Durbin",adult,Blacklight/Fluorescent,Photograph,1,77,77,67,4,135,29.85,"parthly cloudy","10% visible",
238084,,,,"Drepana arcuata","Arched Hooktip",Iowa,Linn,2019-09-05,"2000 - 2300","Wickiup Hill Outdoor Learning Area",42.087352,-91.767107,"Jim Durbin",adult,Blacklight/Fluorescent,Photograph,1,72,71,62,3,100,29.81,clear,"50% visible",
267791,,,,"Drepana arcuata","Arched Hooktip",Iowa,Linn,2020-06-28,22:58:25,"Wickiup Hill Outdoor Learning Area",42.08735076,-91.76706884,"Jim Durbin",adult,Blacklight/Fluorescent,Photograph,1,78,76,70,4,110,29.57,clear,"50% visible",
311817,,,,"Drepana arcuata","Arched Hooktip",Iowa,Linn,2022-07-12,22:46:42,"Matsell Bridge Natural Area",42.13222612,-91.38533046,"Jim Durbin",adult,Sighting,Photograph,1,73,80,67,0,0,29.93,clear,"full moon",
340212,,,,"Drepana arcuata","Arched Hooktip",Iowa,Linn,2023-08-15,21:57:04,"Matsell Bridge Natural Area",42.13218339,-91.38536314,"Jim Durbin",adult,Blacklight/Fluorescent,Photograph,1,67,87,63,1,330,30.04,clear,,
340259,,,,"Drepana arcuata","Arched Hooktip",Iowa,Linn,2023-08-15,22:31:31,"Matsell Bridge Natural Area",42.13218339,-91.38536314,"Jim Durbin",adult,Blacklight/Fluorescent,Photograph,1,67,87,63,1,330,30.04,clear,,
340375,,,,"Drepana arcuata","Arched Hooktip",Iowa,Linn,2023-08-20,21:20:55,"Pinicon Ridge Park",42.21852826,-91.53878734,"Jim Durbin",adult,Blacklight/Fluorescent,Photograph,1,87,73,77,2,360,30.09,"partly cloudy","10% visible",
340436,,,,"Drepana arcuata","Arched Hooktip",Iowa,Linn,2023-08-20,21:45:39,"Pinicon Ridge Park",42.21852826,-91.53878734,"Jim Durbin",adult,Blacklight/Fluorescent,Photograph,1,87,73,77,2,360,30.09,"partly cloudy","10% visible",
340479,,,,"Drepana arcuata","Arched Hooktip",Iowa,Linn,2023-08-20,22:09:52,"Pinicon Ridge Park",42.21852826,-91.53878734,"Jim Durbin",adult,Blacklight/Fluorescent,Photograph,1,87,73,77,2,360,30.09,"partly cloudy","10% visible",
340482,,,,"Drepana arcuata","Arched Hooktip",Iowa,Linn,2023-08-20,22:10:06,"Pinicon Ridge Park",42.21852826,-91.53878734,"Jim Durbin",adult,Blacklight/Fluorescent,Photograph,1,87,73,77,2,360,30.09,"partly cloudy","10% visible",
340484,,,,"Drepana arcuata","Arched Hooktip",Iowa,Linn,2023-08-20,22:10:20,"Pinicon Ridge Park",42.21852826,-91.53878734,"Jim Durbin",adult,Blacklight/Fluorescent,Photograph,1,87,73,77,2,360,30.09,"partly cloudy","10% visible",
340489,,,,"Drepana arcuata","Arched Hooktip",Iowa,Linn,2023-08-20,22:11:18,"Pinicon Ridge Park",42.21852826,-91.53878734,"Jim Durbin",adult,Blacklight/Fluorescent,Photograph,1,87,73,77,2,360,30.09,"partly cloudy","10% visible",
340491,,,,"Drepana arcuata","Arched Hooktip",Iowa,Linn,2023-08-20,22:11:42,"Pinicon Ridge Park",42.21852826,-91.53878734,"Jim Durbin",adult,Blacklight/Fluorescent,Photograph,1,87,73,77,2,360,30.09,"partly cloudy","10% visible",
340514,,,,"Drepana arcuata","Arched Hooktip",Iowa,Linn,2023-08-20,22:21:06,"Pinicon Ridge Park",42.21852826,-91.53878734,"Jim Durbin",adult,Blacklight/Fluorescent,Photograph,1,87,73,77,2,360,30.09,"partly cloudy","10% visible",
