ID,"Collection / Source","Catalog Number","Specify Number",Taxon,"Common Name",State,County,Date,Time,Locale,Latitude,Longitude,Collector,"Life Stage","Collection Method","Preparation Type",Count,Temperature,Humidity,"Dew Point",Wind,"Wind Direction","Barometric Pressure",Sky,"Moon Phase",Notes
29518,"Jim Durbin Drawer 052",2014-029871,SPM000636,"Heliomata cycladata","Common Spring Moth",Iowa,Linn,2004-05-03,,"Wickiup Hill Outdoor Learning Area",42.08398,-91.7651,"Jim Durbin",adult,Blacklight/Fluorescent,Pinned,1,,,,,,,,,
29519,"Jim Durbin Drawer 052",2014-029872,SPM001666,"Heliomata cycladata","Common Spring Moth",Iowa,Linn,2004-05-03,,"Wickiup Hill Outdoor Learning Area",42.08398,-91.7651,"Jim Durbin",adult,Blacklight/Fluorescent,Pinned,1,,,,,,,,,
29520,"Frank Olsen Drawer 46",2014-029873,SPM002989,"Heliomata cycladata","Common Spring Moth",Iowa,Linn,2004-05-06,,"Wickiup Hill Outdoor Learning Area",42.08398,-91.7651,"Frank Olsen",adult,,Pinned,1,,,,,,,,,"Located at Iowa State"
29527,"Jim Durbin Drawer 052",2014-029880,SPM004567,"Heliomata cycladata","Common Spring Moth",Iowa,Linn,2005-06-03,,"Wickiup Hill Outdoor Learning Area",42.08398,-91.7651,"Jim Durbin",adult,Blacklight/Fluorescent,Pinned,1,,,,,,,,,
29528,"Jim Durbin Drawer 052",2014-029881,SPM004569,"Heliomata cycladata","Common Spring Moth",Iowa,Linn,2005-06-03,,"Wickiup Hill Outdoor Learning Area",42.08398,-91.7651,"Jim Durbin",adult,Blacklight/Fluorescent,Pinned,1,,,,,,,,,
29529,"Frank Olsen Drawer 46",2014-029882,SPM005534,"Heliomata cycladata","Common Spring Moth",Iowa,Linn,2005-06-01,,"Wickiup Hill Outdoor Learning Area",42.08398,-91.7651,"Frank Olsen",adult,,Pinned,1,,,,,,,,,"Located at Iowa State"
29542,,2014-029895,SPM017802,"Heliomata cycladata","Common Spring Moth",Iowa,Linn,2010-06-03,,"Pinicon Ridge Park",42.21188,-91.54753,"Frank Olsen",adult,,Sighting,1,,,,,,,,,
29551,"Jim Durbin Drawer 052",2014-029904,SPM026264,"Heliomata cycladata","Common Spring Moth",Iowa,Linn,2012-04-25,,"Matsell Bridge Natural Area",42.13131,-91.38886,"Jim Durbin",adult,Blacklight/Fluorescent,Pinned,1,,,,,,,,,
29552,,2014-029905,SPM026417,"Heliomata cycladata","Common Spring Moth",Iowa,Linn,2012-04-25,,"Matsell Bridge Natural Area",42.13131,-91.38886,"Jim Durbin",adult,Blacklight/Fluorescent,Photograph,1,,,,,,,,,
29553,,2014-029906,SPM027197,"Heliomata cycladata","Common Spring Moth",Iowa,Linn,2012-05-18,,"Matsell Bridge Natural Area",42.13131,-91.38886,"Jim Durbin",adult,Blacklight/Fluorescent,Photograph,1,,,,,,,,,
29555,,2014-029908,SPM034127,"Heliomata cycladata","Common Spring Moth",Iowa,Linn,2013-06-18,,"Matsell Bridge Natural Area",42.13131,-91.38886,"Jim Durbin",adult,Blacklight/Fluorescent,Photograph,1,,,,,,,,,
29556,,2014-029909,SPM034163,"Heliomata cycladata","Common Spring Moth",Iowa,Linn,2013-06-18,,"Matsell Bridge Natural Area",42.13131,-91.38886,"Jim Durbin",adult,Blacklight/Fluorescent,Photograph,1,,,,,,,,,
29558,,2014-029911,SPM039977,"Heliomata cycladata","Common Spring Moth",Iowa,Linn,2014-06-02,,"Pinicon Ridge Park",42.21028,-91.54417,"Jim Durbin",adult,Blacklight/Fluorescent,Photograph,1,,,,,,,,,
29559,,2014-029912,SPM039978,"Heliomata cycladata","Common Spring Moth",Iowa,Linn,2014-06-02,,"Pinicon Ridge Park",42.21028,-91.54417,"Jim Durbin",adult,Blacklight/Fluorescent,Photograph,1,,,,,,,,,
29560,,2014-029913,SPM040171,"Heliomata cycladata","Common Spring Moth",Iowa,Linn,2014-06-08,,"Pleasant Creek State Recreation Area, Linn County",42.10948,-91.8249,"Jim Durbin",adult,Blacklight/Fluorescent,Photograph,1,,,,,,,,,
29561,,2014-029914,SPM040172,"Heliomata cycladata","Common Spring Moth",Iowa,Linn,2014-06-08,,"Pleasant Creek State Recreation Area, Linn County",42.10948,-91.8249,"Jim Durbin",adult,Blacklight/Fluorescent,Photograph,1,,,,,,,,,
29562,,2014-029915,SPM040257,"Heliomata cycladata","Common Spring Moth",Iowa,Linn,2014-06-08,,"Pleasant Creek State Recreation Area, Linn County",42.10948,-91.8249,"Jim Durbin",adult,Blacklight/Fluorescent,Photograph,1,,,,,,,,,
29563,,2014-029916,SPM040258,"Heliomata cycladata","Common Spring Moth",Iowa,Linn,2014-06-08,,"Pleasant Creek State Recreation Area, Linn County",42.10948,-91.8249,"Jim Durbin",adult,Blacklight/Fluorescent,Photograph,1,,,,,,,,,
29564,,2014-029917,SPM040418,"Heliomata cycladata","Common Spring Moth",Iowa,Linn,2014-06-10,,"Pleasant Creek State Recreation Area, Linn County",42.10948,-91.8249,"Jim Durbin",adult,Blacklight/Fluorescent,Photograph,1,,,,,,,,,
29565,,2014-029918,SPM040422,"Heliomata cycladata","Common Spring Moth",Iowa,Linn,2014-06-10,,"Pleasant Creek State Recreation Area, Linn County",42.10948,-91.8249,"Jim Durbin",adult,Blacklight/Fluorescent,Photograph,1,,,,,,,,,
29566,,2014-029919,SPM040482,"Heliomata cycladata","Common Spring Moth",Iowa,Linn,2014-06-13,,"Pleasant Creek State Recreation Area, Linn County",42.10948,-91.8249,"Jim Durbin",adult,Blacklight/Fluorescent,Photograph,1,,,,,,,,,
29567,,2014-029920,SPM040554,"Heliomata cycladata","Common Spring Moth",Iowa,Linn,2014-06-13,,"Pleasant Creek State Recreation Area, Linn County",42.10948,-91.8249,"Jim Durbin",adult,Blacklight/Fluorescent,Photograph,1,,,,,,,,,
29568,,2014-029921,SPM040602,"Heliomata cycladata","Common Spring Moth",Iowa,Linn,2014-06-13,,"Pleasant Creek State Recreation Area, Linn County",42.10948,-91.8249,"Jim Durbin",adult,Blacklight/Fluorescent,Photograph,1,,,,,,,,,
29569,,2014-029922,SPM040603,"Heliomata cycladata","Common Spring Moth",Iowa,Linn,2014-06-13,,"Pleasant Creek State Recreation Area, Linn County",42.10948,-91.8249,"Jim Durbin",adult,Blacklight/Fluorescent,Photograph,1,,,,,,,,,
29570,,2014-029923,SPM040611,"Heliomata cycladata","Common Spring Moth",Iowa,Linn,2014-06-13,,"Pleasant Creek State Recreation Area, Linn County",42.10948,-91.8249,"Jim Durbin",adult,Blacklight/Fluorescent,Photograph,1,,,,,,,,,
29571,,2014-029924,SPM040793,"Heliomata cycladata","Common Spring Moth",Iowa,Linn,2014-06-17,,"Pleasant Creek State Recreation Area, Linn County",42.10948,-91.8249,"Jim Durbin",adult,Blacklight/Fluorescent,Photograph,1,,,,,,,,,
29572,,2014-029925,SPM040915,"Heliomata cycladata","Common Spring Moth",Iowa,Linn,2014-06-17,,"Pleasant Creek State Recreation Area, Linn County",42.10948,-91.8249,"Jim Durbin",adult,Blacklight/Fluorescent,Photograph,1,,,,,,,,,
29573,,2014-029926,SPM041621,"Heliomata cycladata","Common Spring Moth",Iowa,Linn,2014-06-24,,"Pleasant Creek State Recreation Area, Linn County",42.10948,-91.8249,"Jim Durbin",adult,Blacklight/Fluorescent,Photograph,1,,,,,,,,,
29574,,2014-029927,SPM041644,"Heliomata cycladata","Common Spring Moth",Iowa,Linn,2014-06-24,,"Pleasant Creek State Recreation Area, Linn County",42.10948,-91.8249,"Jim Durbin",adult,Blacklight/Fluorescent,Photograph,1,,,,,,,,,
29575,,2014-029928,SPM041674,"Heliomata cycladata","Common Spring Moth",Iowa,Linn,2014-06-24,,"Pleasant Creek State Recreation Area, Linn County",42.10948,-91.8249,"Jim Durbin",adult,Blacklight/Fluorescent,Photograph,1,,,,,,,,,
29576,,2014-029929,SPM041693,"Heliomata cycladata","Common Spring Moth",Iowa,Linn,2014-06-24,,"Pleasant Creek State Recreation Area, Linn County",42.10948,-91.8249,"Jim Durbin",adult,Blacklight/Fluorescent,Photograph,1,,,,,,,,,
49555,,2014-049936,SPM012066,"Heliomata cycladata","Common Spring Moth",Iowa,Linn,2008-08-10,,Redacted,Redacted,Redacted,"Jim Durbin",adult,Blacklight/Fluorescent,Photograph,1,,,,,,,,,
67077,"Frank Olsen Drawer 46",2014-067682,,"Heliomata cycladata","Common Spring Moth",Iowa,Linn,2014-06-18,,"Matsell Bridge Natural Area",42.13131,-91.38886,"Frank Olsen",adult,,Pinned,1,,,,,,,,,"Located at Iowa State"
126483,,2015-017051,,"Heliomata cycladata","Common Spring Moth",Iowa,Linn,2015-06-08,2100-2315,"Matsell Bridge Natural Area",42.131959,-91.388307,"Jim Durbin",adult,Blacklight/Fluorescent,Photograph,1,77,49,56,0,210,29.78,clear,"55% visible",
126485,,2015-017053,,"Heliomata cycladata","Common Spring Moth",Iowa,Linn,2015-06-08,2100-2315,"Matsell Bridge Natural Area",42.131959,-91.388307,"Jim Durbin",adult,Blacklight/Fluorescent,Photograph,1,77,49,56,0,210,29.78,clear,"55% visible",
126490,,2015-017058,,"Heliomata cycladata","Common Spring Moth",Iowa,Linn,2015-06-08,2100-2315,"Matsell Bridge Natural Area",42.131959,-91.388307,"Jim Durbin",adult,Blacklight/Fluorescent,Photograph,1,77,49,56,0,210,29.78,clear,"55% visible",
126499,,2015-017067,,"Heliomata cycladata","Common Spring Moth",Iowa,Linn,2015-06-08,2100-2315,"Matsell Bridge Natural Area",42.131959,-91.388307,"Jim Durbin",adult,Blacklight/Fluorescent,Photograph,1,77,49,56,0,210,29.78,clear,"55% visible",
126563,,2015-017131,,"Heliomata cycladata","Common Spring Moth",Iowa,Linn,2015-06-08,2100-2315,"Matsell Bridge Natural Area",42.131959,-91.388307,"Jim Durbin",adult,Blacklight/Fluorescent,Photograph,1,77,49,56,0,210,29.78,clear,"55% visible",
126637,,2015-017205,,"Heliomata cycladata","Common Spring Moth",Iowa,Linn,2015-06-08,2100-2315,"Matsell Bridge Natural Area",42.131959,-91.388307,"Jim Durbin",adult,Blacklight/Fluorescent,Photograph,1,77,49,56,0,210,29.78,clear,"55% visible",
126646,,2015-017214,,"Heliomata cycladata","Common Spring Moth",Iowa,Linn,2015-06-08,2100-2315,"Matsell Bridge Natural Area",42.131959,-91.388307,"Jim Durbin",adult,Blacklight/Fluorescent,Photograph,1,77,49,56,0,210,29.78,clear,"55% visible",
126872,,2015-017440,,"Heliomata cycladata","Common Spring Moth",Iowa,Linn,2015-06-10,2100-2315,"Pleasant Creek State Recreation Area, Linn County",42.109952,-91.822641,"Jim Durbin",adult,Blacklight/Florescent,Photograph,1,82,41,56,6,45,29.75,clear,"40% visible",
127634,,2015-018224,,"Heliomata cycladata","Common Spring Moth",Iowa,Linn,2015-06-23,,"Matsell Bridge Natural Area",42.131959,-91.388307,"Jim Durbin",adult,Blacklight/Fluorescent,Photograph,1,,,,,,,,,
132917,"Frank Olsen Drawer 46",2015-023511,,"Heliomata cycladata","Common Spring Moth",Iowa,Linn,2015-06-09,,"Pleasant Creek State Recreation Area, Linn County",42.109952,-91.822641,"Frank Olsen",adult,,Pinned,1,,,,,,,,,"Located at Iowa State"
192400,,2017-010361,,"Heliomata cycladata","Common Spring Moth",Iowa,Linn,2017-06-10,2100-2330,"Hitaga Sand Ridge Prairie Preserve",42.250957,-91.632098,"Jim Durbin",adult,Blacklight/Fluorescent,Photograph,1,83,54,65,16,190,29.68,clear,Full,
232011,,2019-006724,,"Heliomata cycladata","Common Spring Moth",Iowa,Linn,2019-06-17,2100-2300,"Hitaga Sand Ridge Prairie Preserve",42.250957,-91.632098,"Jim Durbin",adult,Blacklight/Fluorescent,Photograph,1,71,68,60,5,110,29.97,cloudy,full,
232247,,2019-006960,,"Heliomata cycladata","Common Spring Moth",Iowa,Linn,2019-06-23,2100-2315,"Matsell Bridge Natural Area",42.132148,-91.385221,"Jim Durbin",adult,Blacklight/Fluorescent,Photograph,1,73,73,64,2,190,29.54,cloudy,"90% visible",
232306,,2019-007019,,"Heliomata cycladata","Common Spring Moth",Iowa,Linn,2019-06-23,2100-2315,"Matsell Bridge Natural Area",42.132148,-91.385221,"Jim Durbin",adult,Blacklight/Fluorescent,Photograph,1,73,73,64,2,190,29.54,cloudy,"90% visible",
232321,,2019-007034,,"Heliomata cycladata","Common Spring Moth",Iowa,Linn,2019-06-23,2100-2315,"Matsell Bridge Natural Area",42.132148,-91.385221,"Jim Durbin",adult,Blacklight/Fluorescent,Photograph,1,73,73,64,2,190,29.54,cloudy,"90% visible",
232326,,2019-007039,,"Heliomata cycladata","Common Spring Moth",Iowa,Linn,2019-06-23,2100-2315,"Matsell Bridge Natural Area",42.132148,-91.385221,"Jim Durbin",adult,Blacklight/Fluorescent,Photograph,1,73,73,64,2,190,29.54,cloudy,"90% visible",
265089,,,,"Heliomata cycladata","Common Spring Moth",Iowa,Linn,2020-05-27,21:31:32,"Matsell Bridge Natural Area",42.13204088,-91.38537304,"Jim Durbin",adult,Blacklight/Fluorescent,Photograph,1,73,94,72,0,280,29.89,cloudy,"10% visible",
265236,,,,"Heliomata cycladata","Common Spring Moth",Iowa,Linn,2020-06-01,21:34:37,"Rehrauer Natural Area",42.2551662,-91.4885161,"Jim Durbin",adult,Blacklight/Fluorescent,Photograph,1,,,,,,,,,
267564,,,,"Heliomata cycladata","Common Spring Moth",Iowa,Linn,2020-06-23,22:49:29,"Matsell Bridge Natural Area",42.13215952,-91.38525882,"Jim Durbin",adult,Blacklight/Fluorescent,Photograph,1,64,100,62,3,290,29.9,cloudy,"no moon",
267624,,,,"Heliomata cycladata","Common Spring Moth",Iowa,Linn,2020-06-23,22:07:36,"Matsell Bridge Natural Area",42.13215952,-91.38525882,"Jim Durbin",adult,Blacklight/Fluorescent,Photograph,1,64,100,62,3,290,29.9,cloudy,"no moon",
287859,,,,"Heliomata cycladata","Common Spring Moth",Iowa,Linn,2021-05-24,21:34:18,"Matsell Bridge Natural Area",42.13218947,-91.38528806,"Jim Durbin",adult,Blacklight/Fluorescent,Photograph,1,76,77,68,4,190,30,Cloudy,"full moon",
288444,,,,"Heliomata cycladata","Common Spring Moth",Iowa,Linn,2021-06-12,22:28:49,"Pleasant Creek State Recreation Area, Linn County",42.11007461,-91.82771882,"Jim Durbin",adult,Blacklight/Fluorescent,Photograph,1,78,30,45,4,0,29.88,clear,"10% visible",
288484,,,,"Heliomata cycladata","Common Spring Moth",Iowa,Linn,2021-06-12,22:11:57,"Pleasant Creek State Recreation Area, Linn County",42.11007461,-91.82771882,"Jim Durbin",adult,Blacklight/Fluorescent,Photograph,1,78,30,45,4,0,29.88,clear,"10% visible",
288826,,,,"Heliomata cycladata","Common Spring Moth",Iowa,Linn,2021-06-18,22:33:54,"Hitaga Sand Ridge Prairie Preserve",42.25091805,-91.63221484,"Jim Durbin",adult,Blacklight/Fluorescent,Photograph,1,84,46,61,4,180,29.75,"partly cloudy","50% visible",
288862,,,,"Heliomata cycladata","Common Spring Moth",Iowa,Linn,2021-06-18,22:25:53,"Hitaga Sand Ridge Prairie Preserve",42.25091805,-91.63221484,"Jim Durbin",adult,Blacklight/Fluorescent,Photograph,1,84,46,61,4,180,29.75,"partly cloudy","50% visible",
288889,,,,"Heliomata cycladata","Common Spring Moth",Iowa,Linn,2021-06-18,22:14:49,"Hitaga Sand Ridge Prairie Preserve",42.25091805,-91.63221484,"Jim Durbin",adult,Blacklight/Fluorescent,Photograph,1,84,46,61,4,180,29.75,"partly cloudy","50% visible",
288995,,,,"Heliomata cycladata","Common Spring Moth",Iowa,Linn,2021-06-18,21:51:26,"Hitaga Sand Ridge Prairie Preserve",42.25091805,-91.63221484,"Jim Durbin",adult,Blacklight/Fluorescent,Photograph,1,84,46,61,4,180,29.75,"partly cloudy","50% visible",
289056,,,,"Heliomata cycladata","Common Spring Moth",Iowa,Linn,2021-06-18,21:38:13,"Hitaga Sand Ridge Prairie Preserve",42.25091805,-91.63221484,"Jim Durbin",adult,Blacklight/Fluorescent,Photograph,1,84,46,61,4,180,29.75,"partly cloudy","50% visible",
289161,,,,"Heliomata cycladata","Common Spring Moth",Iowa,Linn,2021-06-18,21:04:59,"Hitaga Sand Ridge Prairie Preserve",42.25091805,-91.63221484,"Jim Durbin",adult,Blacklight/Fluorescent,Photograph,1,84,46,61,4,180,29.75,"partly cloudy","50% visible",
289166,,,,"Heliomata cycladata","Common Spring Moth",Iowa,Linn,2021-06-18,21:02:50,"Hitaga Sand Ridge Prairie Preserve",42.25091805,-91.63221484,"Jim Durbin",adult,Blacklight/Fluorescent,Photograph,1,84,46,61,4,180,29.75,"partly cloudy","50% visible",
289346,,,,"Heliomata cycladata","Common Spring Moth",Iowa,Linn,2021-06-27,23:02:43,"Pleasant Creek State Recreation Area, Linn County",42.1102396,-91.82752613,"Jim Durbin",adult,Sighting,Photograph,1,74,70,64,0,165,29.92,clear,"90% visible",
309848,,,,"Heliomata cycladata","Common Spring Moth",Iowa,Linn,2022-06-09,21:51:05,"Matsell Bridge Natural Area",42.1322708,-91.38538363,"Jim Durbin",adult,Blacklight/Fluorescent,Photograph,1,68,59,53,0,0,29.95,cloudy,"60% visible",
309862,,,,"Heliomata cycladata","Common Spring Moth",Iowa,Linn,2022-06-09,21:44:30,"Matsell Bridge Natural Area",42.1322708,-91.38538363,"Jim Durbin",adult,Blacklight/Fluorescent,Photograph,1,68,59,53,0,0,29.95,cloudy,"60% visible",
309980,,,,"Heliomata cycladata","Common Spring Moth",Iowa,Linn,2022-06-09,20:31:41,"Matsell Bridge Natural Area",42.1322708,-91.38538363,"Jim Durbin",adult,Blacklight/Fluorescent,Photograph,1,68,59,53,0,0,29.95,cloudy,"60% visible",
309983,,,,"Heliomata cycladata","Common Spring Moth",Iowa,Linn,2022-06-09,20:31:15,"Matsell Bridge Natural Area",42.1322708,-91.38538363,"Jim Durbin",adult,Blacklight/Fluorescent,Photograph,1,68,59,53,0,0,29.95,cloudy,"60% visible",
310005,,,,"Heliomata cycladata","Common Spring Moth",Iowa,Linn,2022-06-09,20:03:56,"Matsell Bridge Natural Area",42.1322708,-91.38538363,"Jim Durbin",adult,Blacklight/Fluorescent,Photograph,1,68,59,53,0,0,29.95,cloudy,"60% visible",
310791,,,,"Heliomata cycladata","Common Spring Moth",Iowa,Linn,2022-06-24,22:12:35,"Pinicon Ridge Park",42.21090343,-91.54429735,"Jim Durbin",adult,Blacklight/Fluorescent,Photograph,1,75,67,62,8,180,29.96,"partly cloudy","40% moon",
310869,,,,"Heliomata cycladata","Common Spring Moth",Iowa,Linn,2022-06-24,21:44:04,"Pinicon Ridge Park",42.21090343,-91.54429735,"Jim Durbin",adult,Blacklight/Fluorescent,Photograph,1,75,67,62,8,180,29.96,"partly cloudy","40% moon",
