ID,"Collection / Source","Catalog Number","Specify Number",Taxon,"Common Name",State,County,Date,Time,Locale,Latitude,Longitude,Collector,"Life Stage","Collection Method","Preparation Type",Count,Temperature,Humidity,"Dew Point",Wind,"Wind Direction","Barometric Pressure",Sky,"Moon Phase",Notes
286,"Frank Olsen Drawer 44",2014-000286,SPM010622,"Chlorochlamys chloroleucaria","Blackberry Looper Moth",Iowa,Linn,2007-05-18,,"Pinicon Ridge Park",42.21188,-91.54753,"Frank Olsen",adult,,Pinned,1,,,,,,,,,"Located at Iowa State"
1403,,2014-001403,,"Chlorochlamys chloroleucaria","Blackberry Looper Moth",Iowa,Linn,2014-07-31,,"Pleasant Creek State Recreation Area, Linn County",42.110327,-91.822988,"Jim Durbin",adult,Blacklight/Fluorescent,Photograph,1,,,,,,,,,
20529,"Frank Olsen Drawer 44",2014-020866,SPM002777,"Chlorochlamys chloroleucaria","Blackberry Looper Moth",Iowa,Linn,2003-05-25,,"Wanatee County Park",42.00994,-91.57749,"Frank Olsen",adult,,Pinned,1,,,,,,,,,"Located at Iowa State"
20532,"Jim Durbin Drawer 070",2014-020869,SPM011806,"Chlorochlamys chloroleucaria","Blackberry Looper Moth",Iowa,Linn,2008-08-01,,"Behren's Pond Woodland State Preserve",42.118214,-91.754324,"Jim Durbin",adult,Blacklight/Fluorescent,Pinned,1,,,,,,,,,
20536,"Jim Durbin Drawer 070",2014-020873,SPM019055,"Chlorochlamys chloroleucaria","Blackberry Looper Moth",Iowa,Linn,2010-07-25,,"Rock Island Botanical State Preserve",42.02732,-91.72723,"Tom Jantscher",adult,,Pinned,1,,,,,,,,,
20540,"Jim Durbin Drawer 070",2014-020877,SPM021366,"Chlorochlamys chloroleucaria","Blackberry Looper Moth",Iowa,Linn,2011-05-12,,"Wanatee County Park",42.0094,-91.56623,"Jim Durbin",adult,Blacklight/Fluorescent,Pinned,1,,,,,,,,,
20541,"Jim Durbin Drawer 070",2014-020878,SPM023761,"Chlorochlamys chloroleucaria","Blackberry Looper Moth",Iowa,Linn,2011-09-02,,"Wanatee County Park",42.0094,-91.56623,"Jim Durbin",adult,Blacklight/Fluorescent,Pinned,1,,,,,,,,,
20549,"Jim Durbin Drawer 070",2014-020886,SPM026716,"Chlorochlamys chloroleucaria","Blackberry Looper Moth",Iowa,Linn,2012-05-06,,"Matsell Bridge Natural Area",42.13131,-91.38886,"Jim Durbin",adult,Blacklight/Fluorescent,Pinned,1,,,,,,,,,
20550,,2014-020887,SPM026839,"Chlorochlamys chloroleucaria","Blackberry Looper Moth",Iowa,Linn,2012-05-06,,"Matsell Bridge Natural Area",42.13131,-91.38886,"Jim Durbin",adult,Blacklight/Fluorescent,Photograph,1,,,,,,,,,
20554,,2014-020891,SPM029988,"Chlorochlamys chloroleucaria","Blackberry Looper Moth",Iowa,Linn,2012-07-05,,"Wakpicada Natural Area",42.18892,-91.52035,"Jim Durbin",adult,Blacklight/Fluorescent,Photograph,1,,,,,,,,,
20555,"Jim Durbin Drawer 070",2014-020892,SPM030432,"Chlorochlamys chloroleucaria","Blackberry Looper Moth",Iowa,Linn,2012-07-16,,"Matsell Bridge Natural Area",42.13131,-91.38886,"Jim Durbin",adult,Blacklight/Fluorescent,Pinned,1,,,,,,,,,
20556,"Jim Durbin Drawer 070",2014-020893,SPM030435,"Chlorochlamys chloroleucaria","Blackberry Looper Moth",Iowa,Linn,2012-07-16,,"Matsell Bridge Natural Area",42.13131,-91.38886,"Jim Durbin",adult,Blacklight/Fluorescent,Pinned,1,,,,,,,,,
20557,,2014-020894,SPM030779,"Chlorochlamys chloroleucaria","Blackberry Looper Moth",Iowa,Linn,2012-07-19,,"Wanatee County Park",42.01026,-91.57381,"Jim Durbin",adult,Blacklight/Fluorescent,Photograph,1,,,,,,,,,
20558,,2014-020895,SPM031156,"Chlorochlamys chloroleucaria","Blackberry Looper Moth",Iowa,Linn,2012-07-29,,"Matsell Bridge Natural Area",42.13131,-91.38886,"Jim Durbin",adult,Blacklight/Fluorescent,Photograph,1,,,,,,,,,
20559,,2014-020896,SPM031157,"Chlorochlamys chloroleucaria","Blackberry Looper Moth",Iowa,Linn,2012-07-29,,"Matsell Bridge Natural Area",42.13131,-91.38886,"Jim Durbin",adult,Blacklight/Fluorescent,Photograph,1,,,,,,,,,
20560,,2014-020897,SPM031158,"Chlorochlamys chloroleucaria","Blackberry Looper Moth",Iowa,Linn,2012-07-29,,"Matsell Bridge Natural Area",42.13131,-91.38886,"Jim Durbin",adult,Blacklight/Fluorescent,Photograph,1,,,,,,,,,
20562,,2014-020899,SPM031377,"Chlorochlamys chloroleucaria","Blackberry Looper Moth",Iowa,Linn,2012-08-18,,"Matsell Bridge Natural Area",42.13131,-91.38886,"Jim Durbin",adult,Blacklight/Fluorescent,Photograph,1,,,,,,,,,
20563,,2014-020900,SPM031463,"Chlorochlamys chloroleucaria","Blackberry Looper Moth",Iowa,Linn,2012-08-24,,"Wanatee County Park",42.0094,-91.56623,"Jim Durbin",adult,Blacklight/Fluorescent,Photograph,1,,,,,,,,,
20582,,2014-020919,SPM040540,"Chlorochlamys chloroleucaria","Blackberry Looper Moth",Iowa,Linn,2014-06-13,,"Pleasant Creek State Recreation Area, Linn County",42.10948,-91.8249,"Jim Durbin",adult,Blacklight/Fluorescent,Photograph,1,,,,,,,,,
20583,,2014-020920,SPM040562,"Chlorochlamys chloroleucaria","Blackberry Looper Moth",Iowa,Linn,2014-06-13,,"Pleasant Creek State Recreation Area, Linn County",42.10948,-91.8249,"Jim Durbin",adult,Blacklight/Fluorescent,Photograph,1,,,,,,,,,
20584,,2014-020921,SPM040852,"Chlorochlamys chloroleucaria","Blackberry Looper Moth",Iowa,Linn,2014-06-17,,"Pleasant Creek State Recreation Area, Linn County",42.10948,-91.8249,"Jim Durbin",adult,Blacklight/Fluorescent,Photograph,1,,,,,,,,,
49909,,2014-050290,,"Chlorochlamys chloroleucaria","Blackberry Looper Moth",Iowa,Linn,2014-08-13,,"Pleasant Creek State Recreation Area, Linn County",42.110327,-91.822988,"Jim Durbin",adult,Blacklight/Fluorescent,Photograph,1,,,,,,,,,
65231,,2014-065832,,"Chlorochlamys chloroleucaria","Blackberry Looper Moth",Iowa,Linn,2014-08-30,2000-2300DST,"Pleasant Creek State Recreation Area, Linn County",42.110327,-91.822988,"Jim Durbin",adult,Blacklight/Fluorescent,Photograph,1,77-69,73-97,68-66,4,0,29.88,"Partly Cloudy",,
129986,,2015-020576,,"Chlorochlamys chloroleucaria","Blackberry Looper Moth",Iowa,Linn,2015-09-01,"2000 - 2230","Indian Creek Nature Center",41.968932,-91.586884,"Jim Durbin",adult,Blacklight/Fluorescent,Photograph,1,81,71,71,2,180,29.96,cloudy,"95% visible",
168001,,2016-032746,,"Chlorochlamys chloroleucaria","Blackberry Looper Moth",Iowa,Linn,2016-05-29,2030-2300,"Vecny Woods",41.956725,-91.600854,"Jim Durbin",adult,Blacklight/Fluorescent,Photograph,1,76,54,58,0,180,29.94,"partly cloudy","80% visible","Very damp with short shower."
168198,,2016-032943,,"Chlorochlamys chloroleucaria","Blackberry Looper Moth",Iowa,Linn,2016-05-31,1030-2300,"Hitaga Sand Ridge Prairie Preserve",42.250957,-91.632098,"Jim Durbin",adult,Blacklight/Florescent,Photograph,1,66,100,65,0,0,29.89,cloudy,"30% visible","1030-2300. Rained for about 45 minutes."
168814,,2016-033559,,"Chlorochlamys chloroleucaria","Blackberry Looper Moth",Iowa,Linn,2016-06-05,2045-2300,"Vecny Woods",41.956725,-91.600854,"Jim Durbin",adult,Blacklight/Fluorescent,Photograph,1,80,36,51,4,300,29.67,"partly cloudy","dark phase",
169545,,2016-034290,,"Chlorochlamys chloroleucaria","Blackberry Looper Moth",Iowa,Linn,2016-06-15,2100-2315,"Hitaga Sand Ridge Prairie Preserve",42.250957,-91.632098,"Jim Durbin",adult,Blacklight/Fluorescent,Photograph,1,83,56,66,8,310,29.74,clear,"90% visible",
171567,,2016-036312,,"Chlorochlamys chloroleucaria","Blackberry Looper Moth",Iowa,Linn,2016-07-05,2100-2300,"Hitaga Sand Ridge Prairie Preserve",42.250957,-91.632098,"Jim Durbin",adult,Blacklight/Fluorescent,Photograph,1,80,88,75,4,150,29.76,cloudy,Dark,
173108,,2016-037854,,"Chlorochlamys chloroleucaria","Blackberry Looper Moth",Iowa,Linn,2016-07-30,2100-2330,"Hitaga Sand Ridge Prairie Preserve",42.250957,-91.632098,"Jim Durbin",adult,Blacklight/Fluorescent,Photograph,1,72,87,68,0,0,29092,"partly cloudy","10% visible",
174876,,2016-039626,,"Chlorochlamys chloroleucaria","Blackberry Looper Moth",Iowa,Linn,2016-08-21,2030-2300,"Hitaga Sand Ridge Prairie Preserve",42.250957,-91.632098,"Jim Durbin",adult,Blacklight/Fluorescent,Photograph,1,64,74,55,0,0,30,clear,"80% visible",
174933,,2016-039683,,"Chlorochlamys chloroleucaria","Blackberry Looper Moth",Iowa,Linn,2016-08-21,2030-2300,"Hitaga Sand Ridge Prairie Preserve",42.250957,-91.632098,"Jim Durbin",adult,Blacklight/Fluorescent,Photograph,1,64,74,55,0,0,30,clear,"80% visible",
175192,,2016-039942,,"Chlorochlamys chloroleucaria","Blackberry Looper Moth",Iowa,Linn,2016-08-28,2000-2230,"Hitaga Sand Ridge Prairie Preserve",42.250957,-91.632098,"Jim Durbin",adult,Blacklight/Fluorescent,Photograph,1,74,83,74,9,110,30.1,cloudy,"10% visible","Rained for about 15 minutes at 8:00PM"
175243,,2016-039993,,"Chlorochlamys chloroleucaria","Blackberry Looper Moth",Iowa,Linn,2016-08-28,2000-2230,"Hitaga Sand Ridge Prairie Preserve",42.250957,-91.632098,"Jim Durbin",adult,Blacklight/Fluorescent,Photograph,1,74,83,74,9,110,30.1,cloudy,"10% visible","Rained for about 15 minutes at 8:00PM"
175247,,2016-039997,,"Chlorochlamys chloroleucaria","Blackberry Looper Moth",Iowa,Linn,2016-08-28,2000-2230,"Hitaga Sand Ridge Prairie Preserve",42.250957,-91.632098,"Jim Durbin",adult,Blacklight/Fluorescent,Photograph,1,74,83,74,9,110,30.1,cloudy,"10% visible","Rained for about 15 minutes at 8:00PM"
176320,,2016-041070,,"Chlorochlamys chloroleucaria","Blackberry Looper Moth",Iowa,Linn,2016-09-05,,"Hitaga Sand Ridge Prairie Preserve",42.250957,-91.632098,"Jim Durbin",adult,Blacklight/Fluorescent,Photograph,1,81,61,71,12,190,29090,clear,"10% visible",
191926,,2017-009887,,"Chlorochlamys chloroleucaria","Blackberry Looper Moth",Iowa,Linn,2017-05-31,2030-2300,"Hitaga Sand Ridge Prairie Preserve",42.250957,-91.632098,"Jim Durbin",adult,Blacklight/Fluorescent,Photograph,1,65,43,42,5,0,29.98,clear,"40% visible",
192005,,2017-009966,,"Chlorochlamys chloroleucaria","Blackberry Looper Moth",Iowa,Linn,2017-05-31,2030-2300,"Hitaga Sand Ridge Prairie Preserve",42.250957,-91.632098,"Jim Durbin",adult,Blacklight/Fluorescent,Photograph,1,65,43,42,5,0,29.98,clear,"40% visible",
192215,,2017-010176,,"Chlorochlamys chloroleucaria","Blackberry Looper Moth",Iowa,Linn,2017-06-03,2030-2330,"Wickiup Hill Outdoor Learning Area",42.087567,-91.767578,"Jim Durbin",adult,Blacklight/Fluorescent,Photograph,1,83,44,59,4,280,29.88,clear,"60% visible",
192458,,2017-010419,,"Chlorochlamys chloroleucaria","Blackberry Looper Moth",Iowa,Linn,2017-06-10,2100-2330,"Hitaga Sand Ridge Prairie Preserve",42.250957,-91.632098,"Jim Durbin",adult,Blacklight/Fluorescent,Photograph,1,83,54,65,16,190,29.68,clear,Full,
192626,,2017-010587,,"Chlorochlamys chloroleucaria","Blackberry Looper Moth",Iowa,Linn,2017-06-14,2100-2330,"Wickiup Hill Outdoor Learning Area",42.087567,-91.767578,"Jim Durbin",adult,Blacklight/Fluorescent,Photograph,1,80,73,71,3,120,29.75,cloudy,"90% visible",
192832,,2017-010795,,"Chlorochlamys chloroleucaria","Blackberry Looper Moth",Iowa,Linn,2017-06-24,2045-2300,"Hitaga Sand Ridge Prairie Preserve",42.250957,-91.632098,"Jim Durbin",adult,Blacklight/Fluorescent,Photograph,1,65,43,46,13,280,30.14,clear,new,
193159,,2017-011124,,"Chlorochlamys chloroleucaria","Blackberry Looper Moth",Iowa,Linn,2017-07-01,,"Hitaga Sand Ridge Prairie Preserve",42.250957,-91.632098,"Jim Durbin",adult,Blacklight/Fluorescent,Photograph,1,72,56,55,280,9,29.97,clear,,
194367,,2017-012333,,"Chlorochlamys chloroleucaria","Blackberry Looper Moth",Iowa,Linn,2017-07-22,2045-2330,"Hitaga Sand Ridge Prairie Preserve",42.250957,-91.632098,"Jim Durbin",adult,Blacklight/Fluorescent,Photograph,1,80,94,78,2,330,29.85,"partly cloudy","10 % visible",
194517,,2017-012482,,"Chlorochlamys chloroleucaria","Blackberry Looper Moth",Iowa,Linn,2017-07-29,2045-2315,"Hitaga Sand Ridge Prairie Preserve",42.250957,-91.632098,"Jim Durbin",adult,Blacklight/Fluorescent,Photograph,1,69,73,61,0,0,30.09,clear,"40% visible",
195640,,2017-013604,,"Chlorochlamys chloroleucaria","Blackberry Looper Moth",Iowa,Linn,2017-08-18,2030-2300,"Wickiup Hill Outdoor Learning Area",42.087567,-91.767578,"Jim Durbin",adult,Blacklight/Fluorescent,Photograph,1,71,73,62,5,10,29.88,clear,"20% visible",
195953,,2017-013917,,"Chlorochlamys chloroleucaria","Blackberry Looper Moth",Iowa,Linn,2017-08-23,2000-2300,"Hitaga Sand Ridge Prairie Preserve",42.250957,-91.632098,"Jim Durbin",adult,Blacklight/Fluorescent,Photograph,1,66,84,61,,,30.03,clear,"0 visible",
214024,,2018-012180,,"Chlorochlamys chloroleucaria","Blackberry Looper Moth",Iowa,Linn,2018-07-03,2100-2330,"Wickiup Hill Outdoor Learning Area",42.087352,-91.767107,"Jim Durbin",adult,Blacklight/Fluorescent,Photograph,1,82,68,70,4,90,29.96,Clear,"80 % visible",
214026,,2018-012182,,"Chlorochlamys chloroleucaria","Blackberry Looper Moth",Iowa,Linn,2018-07-03,2100-2330,"Wickiup Hill Outdoor Learning Area",42.087352,-91.767107,"Jim Durbin",adult,Blacklight/Fluorescent,Photograph,1,82,68,70,4,90,29.96,Clear,"80 % visible",
214042,,2018-012198,,"Chlorochlamys chloroleucaria","Blackberry Looper Moth",Iowa,Linn,2018-07-03,2100-2330,"Wickiup Hill Outdoor Learning Area",42.087352,-91.767107,"Jim Durbin",adult,Blacklight/Fluorescent,Photograph,1,82,68,70,4,90,29.96,Clear,"80 % visible",
216180,,2018-014336,,"Chlorochlamys chloroleucaria","Blackberry Looper Moth",Iowa,Linn,2018-07-23,2100-2300,"Hitaga Sand Ridge Prairie Preserve",42.250957,-91.632098,"Jim Durbin",adult,Blacklight/Fluorescent,Photograph,1,78,62,64,1,275,29.98,clear,"80% visible",
218289,,2018-016445,,"Chlorochlamys chloroleucaria","Blackberry Looper Moth",Iowa,Linn,2018-08-08,2045-2315,"Hitaga Sand Ridge Prairie Preserve",42.250957,-91.632098,"Jim Durbin",adult,Blacklight/Fluorescent,Photograph,1,73,83,68,6,210,29.93,clear,"10 % visible",
218520,,2018-016676,,"Chlorochlamys chloroleucaria","Blackberry Looper Moth",Iowa,Linn,2018-08-11,2030-2300,"Hitaga Sand Ridge Prairie Preserve",42.250604,-91.629962,"Jim Durbin",adult,Blacklight/Fluorescent,Photograph,1,74,81,68,5,45,30.06,clear,dark,
218561,,2018-016717,,"Chlorochlamys chloroleucaria","Blackberry Looper Moth",Iowa,Linn,2018-08-11,2030-2300,"Hitaga Sand Ridge Prairie Preserve",42.250604,-91.629962,"Jim Durbin",adult,Blacklight/Fluorescent,Photograph,1,74,81,68,5,45,30.06,clear,dark,
218642,,2018-016798,,"Chlorochlamys chloroleucaria","Blackberry Looper Moth",Iowa,Linn,2018-08-11,2030-2300,"Hitaga Sand Ridge Prairie Preserve",42.250604,-91.629962,"Jim Durbin",adult,Blacklight/Fluorescent,Photograph,1,74.0,81.0,68.0,5.0,45,30.06,clear,dark,
219392,,2018-017548,,"Chlorochlamys chloroleucaria","Blackberry Looper Moth",Iowa,Linn,2018-08-25,2015-2300,"Hitaga Sand Ridge Prairie Preserve",42.250604,-91.629962,"Jim Durbin",adult,Blacklight/Fluorescent,Photograph,1,74,97,73,3,310,29.91,cdlear,"Full Moon",
219484,,2018-017640,,"Chlorochlamys chloroleucaria","Blackberry Looper Moth",Iowa,Linn,2018-08-25,2015-2300,"Hitaga Sand Ridge Prairie Preserve",42.250604,-91.629962,"Jim Durbin",adult,Blacklight/Fluorescent,Photograph,1,74,97,73,3,310,29.91,cdlear,"Full Moon",
219512,,2018-017668,,"Chlorochlamys chloroleucaria","Blackberry Looper Moth",Iowa,Linn,2018-08-25,2015-2300,"Hitaga Sand Ridge Prairie Preserve",42.250604,-91.629962,"Jim Durbin",adult,Blacklight/Fluorescent,Photograph,1,74,97,73,3,310,29.91,cdlear,"Full Moon",
219591,,2018-017747,,"Chlorochlamys chloroleucaria","Blackberry Looper Moth",Iowa,Linn,2018-08-25,2015-2300,"Hitaga Sand Ridge Prairie Preserve",42.250604,-91.629962,"Jim Durbin",adult,Blacklight/Fluorescent,Photograph,1,74,97,73,3,310,29.91,cdlear,"Full Moon",
230256,,2019-004969,,"Chlorochlamys chloroleucaria","Blackberry Looper Moth",Iowa,Linn,2019-05-25,2100-2315,"Hitaga Sand Ridge Prairie Preserve",42.250957,-91.632098,"Jim Durbin",adult,Blacklight/Fluorescent,Photograph,1,75,68,64,1,180,29.82,clear,"80% visible",
230472,,2019-005706,,"Chlorochlamys chloroleucaria","Blackberry Looper Moth",Iowa,Linn,2019-05-30,,"Hitaga Sand Ridge Prairie Preserve",42.250957,-91.632098,"Jim Durbin",adult,Blacklight/Fluorescent,Photograph,1,68,81,62,,,29.82,"partly cloidy","10% visible",
230526,,2019-005760,,"Chlorochlamys chloroleucaria","Blackberry Looper Moth",Iowa,Linn,2019-05-30,,"Hitaga Sand Ridge Prairie Preserve",42.250957,-91.632098,"Jim Durbin",adult,Blacklight/Fluorescent,Photograph,1,68,81,62,,,29.82,"partly cloidy","10% visible",
230623,,2019-005857,,"Chlorochlamys chloroleucaria","Blackberry Looper Moth",Iowa,Linn,2019-05-30,,"Hitaga Sand Ridge Prairie Preserve",42.250957,-91.632098,"Jim Durbin",adult,Blacklight/Fluorescent,Photograph,1,68,81,62,,,29.82,"partly cloidy","10% visible",
231831,,2019-006544,,"Chlorochlamys chloroleucaria","Blackberry Looper Moth",Iowa,Linn,2019-06-14,,"Wickiup Hill Outdoor Learning Area",42.087352,-91.767107,"Jim Durbin",adult,Blacklight/Fluorescent,Photograph,1,68,64,55,5,170,29.64,cloudy,"10% visible",
231834,,2019-006547,,"Chlorochlamys chloroleucaria","Blackberry Looper Moth",Iowa,Linn,2019-06-14,,"Wickiup Hill Outdoor Learning Area",42.087352,-91.767107,"Jim Durbin",adult,Blacklight/Fluorescent,Photograph,1,68,64,55,5,170,29.64,cloudy,"10% visible",
231844,,2019-006557,,"Chlorochlamys chloroleucaria","Blackberry Looper Moth",Iowa,Linn,2019-06-14,,"Wickiup Hill Outdoor Learning Area",42.087352,-91.767107,"Jim Durbin",adult,Blacklight/Fluorescent,Photograph,1,68,64,55,5,170,29.64,cloudy,"10% visible",
231849,,2019-006562,,"Chlorochlamys chloroleucaria","Blackberry Looper Moth",Iowa,Linn,2019-06-14,,"Wickiup Hill Outdoor Learning Area",42.087352,-91.767107,"Jim Durbin",adult,Blacklight/Fluorescent,Photograph,1,68,64,55,5,170,29.64,cloudy,"10% visible",
231855,,2019-006568,,"Chlorochlamys chloroleucaria","Blackberry Looper Moth",Iowa,Linn,2019-06-14,,"Wickiup Hill Outdoor Learning Area",42.087352,-91.767107,"Jim Durbin",adult,Blacklight/Fluorescent,Photograph,1,68,64,55,5,170,29.64,cloudy,"10% visible",
265845,,,,"Chlorochlamys chloroleucaria","Blackberry Looper Moth",Iowa,Linn,2020-06-07,21:52:52,"Wickiup Hill Outdoor Learning Area",42.08736536,-91.76707659,"Jim Durbin",adult,Sighting,Photograph,1,81,49,60,4,170,29.77,clear,full,
266743,,,,"Chlorochlamys chloroleucaria","Blackberry Looper Moth",Iowa,Linn,2020-06-12,22:15:37,"Hitaga Sand Ridge Prairie Preserve",42.2508675,-91.63209427,"Jim Durbin",adult,Blacklight/Fluorescent,Photograph,1,76,48,55,0,0,30.17,"partly cloudy","80% visible",
266821,,,,"Chlorochlamys chloroleucaria","Blackberry Looper Moth",Iowa,Linn,2020-06-12,22:03:23,"Hitaga Sand Ridge Prairie Preserve",42.2508675,-91.63209427,"Jim Durbin",adult,Blacklight/Fluorescent,Photograph,1,76,48,55,0,0,30.17,"partly cloudy","80% visible",
267018,,,,"Chlorochlamys chloroleucaria","Blackberry Looper Moth",Iowa,Linn,2020-06-12,21:10:21,"Hitaga Sand Ridge Prairie Preserve",42.2508675,-91.63209427,"Jim Durbin",adult,Blacklight/Fluorescent,Photograph,1,76,48,55,0,0,30.17,"partly cloudy","80% visible",
288126,,,,"Chlorochlamys chloroleucaria","Blackberry Looper Moth",Iowa,Linn,2021-06-02,22:47:00,"Hitaga Sand Ridge Prairie Preserve",42.25092585,-91.63217796,"Jim Durbin",adult,Blacklight/Fluorescent,Photograph,1,65,69,55,,,29.91,clear,"6% visible",
288147,,,,"Chlorochlamys chloroleucaria","Blackberry Looper Moth",Iowa,Linn,2021-06-02,22:38:43,"Hitaga Sand Ridge Prairie Preserve",42.25092585,-91.63217796,"Jim Durbin",adult,Blacklight/Fluorescent,Photograph,1,65,69,55,,,29.91,clear,"6% visible",
288406,,,,"Chlorochlamys chloroleucaria","Blackberry Looper Moth",Iowa,Linn,2021-06-12,22:49:50,"Pleasant Creek State Recreation Area, Linn County",42.11007461,-91.82771882,"Jim Durbin",adult,Blacklight/Fluorescent,Photograph,1,78,30,45,4,0,29.88,clear,"10% visible",
288494,,,,"Chlorochlamys chloroleucaria","Blackberry Looper Moth",Iowa,Linn,2021-06-12,22:10:16,"Pleasant Creek State Recreation Area, Linn County",42.11007461,-91.82771882,"Jim Durbin",adult,Blacklight/Fluorescent,Photograph,1,78,30,45,4,0,29.88,clear,"10% visible",
288506,,,,"Chlorochlamys chloroleucaria","Blackberry Looper Moth",Iowa,Linn,2021-06-12,22:05:00,"Pleasant Creek State Recreation Area, Linn County",42.11007461,-91.82771882,"Jim Durbin",adult,Blacklight/Fluorescent,Photograph,1,78,30,45,4,0,29.88,clear,"10% visible",
289354,,,,"Chlorochlamys chloroleucaria","Blackberry Looper Moth",Iowa,Linn,2021-06-27,22:53:17,"Pleasant Creek State Recreation Area, Linn County",42.1102396,-91.82752613,"Jim Durbin",adult,Sighting,Photograph,1,74,70,64,0,165,29.92,clear,"90% visible",
309738,,,,"Chlorochlamys chloroleucaria","Blackberry Looper Moth",Iowa,Linn,2022-06-03,20:55:59,"Hitaga Sand Ridge Prairie Preserve",42.25096919,-91.63220559,"Jim Durbin",adult,Blacklight/Fluorescent,Photograph,1,66,32,36,0,0,29.96,clear,"10% visible",
310420,,,,"Chlorochlamys chloroleucaria","Blackberry Looper Moth",Iowa,Linn,2022-06-16,22:29:53,"Wanatee County Park",42.01007932,-91.56651807,"Jim Durbin",adult,Blacklight/Fluorescent,Photograph,1,77,50,57,8,270,29.96,clear,full,
310462,,,,"Chlorochlamys chloroleucaria","Blackberry Looper Moth",Iowa,Linn,2022-06-16,22:10:33,"Wanatee County Park",42.01007932,-91.56651807,"Jim Durbin",adult,Blacklight/Fluorescent,Photograph,1,77,50,57,8,270,29.96,clear,full,
310491,,,,"Chlorochlamys chloroleucaria","Blackberry Looper Moth",Iowa,Linn,2022-06-16,21:53:01,"Wanatee County Park",42.01007932,-91.56651807,"Jim Durbin",adult,Blacklight/Fluorescent,Photograph,1,77,50,57,8,270,29.96,clear,full,
312803,,,,"Chlorochlamys chloroleucaria","Blackberry Looper Moth",Iowa,Linn,2022-07-31,22:25:52,"Pinicon Ridge Park",42.21080865,-91.54426907,"Jim Durbin",adult,Sighting,Photograph,1,77,82,71,2,270,29.9,"mostly cloudy","10% visible",
313715,,,,"Chlorochlamys chloroleucaria","Blackberry Looper Moth",Iowa,Linn,2022-08-25,22:31:13,"Hitaga Sand Ridge Prairie Preserve",42.25103416,-91.63218888,"Jim Durbin",adult,Blacklight/Fluorescent,Photograph,1,73,90,70,2,350,30.03,clear,"10% visible",
313723,,,,"Chlorochlamys chloroleucaria","Blackberry Looper Moth",Iowa,Linn,2022-08-25,22:25:08,"Hitaga Sand Ridge Prairie Preserve",42.25103416,-91.63218888,"Jim Durbin",adult,Blacklight/Fluorescent,Photograph,1,73,90,70,2,350,30.03,clear,"10% visible",
313726,,,,"Chlorochlamys chloroleucaria","Blackberry Looper Moth",Iowa,Linn,2022-08-25,22:23:51,"Hitaga Sand Ridge Prairie Preserve",42.25103416,-91.63218888,"Jim Durbin",adult,Blacklight/Fluorescent,Photograph,1,73,90,70,2,350,30.03,clear,"10% visible",
334466,,,,"Chlorochlamys chloroleucaria","Blackberry Looper Moth",Iowa,Linn,2023-05-15,21:20:33,"Wanatee County Park",42.01004004666667,-91.56646889666666,"Jim Durbin",adult,Blacklight/Fluorescent,Photograph,1,,,,0,,,,,
339556,,,,"Chlorochlamys chloroleucaria","Blackberry Looper Moth",Iowa,Linn,2023-08-09,23:02:49,"Palisades Kepler State Park",41.90832623,-91.50233083,"Jim Durbin",adult,Blacklight/Fluorescent,Photograph,1,73,85,68,0,0,29.78,clear,"50% visible",
340238,,,,"Chlorochlamys chloroleucaria","Blackberry Looper Moth",Iowa,Linn,2023-08-15,22:08:51,"Matsell Bridge Natural Area",42.13218339,-91.38536314,"Jim Durbin",adult,Blacklight/Fluorescent,Photograph,1,67,87,63,1,330,30.04,clear,,
340504,,,,"Chlorochlamys chloroleucaria","Blackberry Looper Moth",Iowa,Linn,2023-08-20,22:17:22,"Pinicon Ridge Park",42.21852826,-91.53878734,"Jim Durbin",adult,Blacklight/Fluorescent,Photograph,1,87,73,77,2,360,30.09,"partly cloudy","10% visible",
340526,,,,"Chlorochlamys chloroleucaria","Blackberry Looper Moth",Iowa,Linn,2023-08-20,22:27:42,"Pinicon Ridge Park",42.21852826,-91.53878734,"Jim Durbin",adult,Blacklight/Fluorescent,Photograph,1,87,73,77,2,360,30.09,"partly cloudy","10% visible",
367174,,,,"Chlorochlamys chloroleucaria","Blackberry Looper Moth",Iowa,Linn,2024-06-15,21:04:34,"Hitaga Sand Ridge Prairie Preserve",42.250848798333,-91.632148993333,"Jim Durbin",adult,Blacklight/Fluorescent,Photograph,1,79,50,59,12,170,29.86,"partly cloudy","50% visible",
