ID,"Collection / Source","Catalog Number","Specify Number",Taxon,"Common Name",State,County,Date,Time,Locale,Latitude,Longitude,Collector,"Life Stage","Collection Method","Preparation Type",Count,Temperature,Humidity,"Dew Point",Wind,"Wind Direction","Barometric Pressure",Sky,"Moon Phase",Notes
23704,,2014-024050,SPM026803,"Dichomeris setosella",None,Iowa,Linn,2012-05-06,,"Matsell Bridge Natural Area",42.13131,-91.38886,"Jim Durbin",adult,Blacklight/Fluorescent,Photograph,1,,,,,,,,,
200151,,2017-018082,,"Dichomeris setosella",None,Iowa,Linn,2016-07-24,,"Hitaga Sand Ridge Prairie Preserve",42.250957,-91.632098,"Don F. Becker",adult,,Photograph,1,,,,,,,,,
236040,,,,"Dichomeris setosella",None,Iowa,Linn,2019-08-11,2030-2300,"Wickiup Hill Outdoor Learning Area",42.087343,-91.767109,"Jim Durbin",adult,Sighting,Photograph,1,75,90,72,4,90,29.81,"parthly cloudy","90% visible",
236053,,,,"Dichomeris setosella",None,Iowa,Linn,2019-08-14,2030-2300,"Hitaga Sand Ridge Prairie Preserve",42.250886,-91.632106,"Jim Durbin",adult,Sighting,Photograph,1,68,89,65,2,260,29.91,"partly cloidy",full,
236102,,,,"Dichomeris setosella",None,Iowa,Linn,2019-08-14,2030-2300,"Hitaga Sand Ridge Prairie Preserve",42.250886,-91.632106,"Jim Durbin",adult,Sighting,Photograph,1,68,89,65,2,260,29.91,"partly cloidy",full,
265473,,,,"Dichomeris setosella",None,Iowa,Linn,2020-06-05,22:21:10,"Hitaga Sand Ridge Prairie Preserve",42.25088607,-91.63212362,"Jim Durbin",adult,Blacklight/Fluorescent,Photograph,1,75,58,59,4,355,29.95,clear,Full,
266942,,,,"Dichomeris setosella",None,Iowa,Linn,2020-06-12,21:34:03,"Hitaga Sand Ridge Prairie Preserve",42.2508675,-91.63209427,"Jim Durbin",adult,Blacklight/Fluorescent,Photograph,1,76,48,55,0,0,30.17,"partly cloudy","80% visible",
312640,,,,"Dichomeris setosella",None,Iowa,Linn,2022-07-26,22:09:17,"Hitaga Sand Ridge Prairie Preserve",42.25103779,-91.63215575,"Jim Durbin",adult,Blacklight/Fluorescent,Photograph,1,76,79,69,1,170,29.91,cloudy,"10% moon",
312713,,,,"Dichomeris setosella",None,Iowa,Linn,2022-07-26,21:20:18,"Hitaga Sand Ridge Prairie Preserve",42.25103779,-91.63215575,"Jim Durbin",adult,Blacklight/Fluorescent,Photograph,1,76,79,69,1,170,29.91,cloudy,"10% moon",
312721,,,,"Dichomeris setosella",None,Iowa,Linn,2022-07-26,21:14:25,"Hitaga Sand Ridge Prairie Preserve",42.25103779,-91.63215575,"Jim Durbin",adult,Blacklight/Fluorescent,Photograph,1,76,79,69,1,170,29.91,cloudy,"10% moon",
312734,,,,"Dichomeris setosella",None,Iowa,Linn,2022-07-26,21:04:45,"Hitaga Sand Ridge Prairie Preserve",42.25103779,-91.63215575,"Jim Durbin",adult,Blacklight/Fluorescent,Photograph,1,76,79,69,1,170,29.91,cloudy,"10% moon",
