ID,"Collection / Source","Catalog Number","Specify Number",Taxon,"Common Name",State,County,Date,Time,Locale,Latitude,Longitude,Collector,"Life Stage","Collection Method","Preparation Type",Count,Temperature,Humidity,"Dew Point",Wind,"Wind Direction","Barometric Pressure",Sky,"Moon Phase",Notes
18467,,2014-018790,SPM027993,"Caloptilia umbratella",None,Iowa,Linn,2012-06-05,,"Wanatee County Park",42.01026,-91.57381,"Jim Durbin",adult,Blacklight/Fluorescent,Photograph,1,,,,,,,,,
18468,,2014-018791,SPM028024,"Caloptilia umbratella",None,Iowa,Linn,2012-06-05,,"Wanatee County Park",42.01026,-91.57381,"Jim Durbin",adult,Blacklight/Fluorescent,Photograph,1,,,,,,,,,
18469,,2014-018792,SPM028025,"Caloptilia umbratella",None,Iowa,Linn,2012-06-05,,"Wanatee County Park",42.01026,-91.57381,"Jim Durbin",adult,Blacklight/Fluorescent,Photograph,1,,,,,,,,,
18472,"Jim Durbin Drawer 003",2014-018795,SPM028788,"Caloptilia umbratella",None,Iowa,Linn,2012-06-17,,"Wanatee County Park",42.01026,-91.57381,"Jim Durbin",adult,Blacklight/Fluorescent,Pinned,1,,,,,,,,,
18473,"Jim Durbin Drawer 003",2014-018796,SPM028797,"Caloptilia umbratella",None,Iowa,Linn,2012-06-17,,"Wanatee County Park",42.01026,-91.57381,"Jim Durbin",adult,Blacklight/Fluorescent,Pinned,1,,,,,,,,,
18474,,2014-018797,SPM028908,"Caloptilia umbratella",None,Iowa,Linn,2012-06-17,,"Wanatee County Park",42.01026,-91.57381,"Jim Durbin",adult,Blacklight/Fluorescent,Photograph,1,,,,,,,,,
18478,,2014-018801,SPM030167,"Caloptilia umbratella",None,Iowa,Linn,2012-07-08,,"Wanatee County Park",42.0094,-91.56623,"Jim Durbin",adult,Blacklight/Fluorescent,Photograph,1,,,,,,,,,
18479,,2014-018802,SPM030970,"Caloptilia umbratella",None,Iowa,Linn,2012-07-27,,"Wanatee County Park",42.0094,-91.56623,"Jim Durbin",adult,Blacklight/Fluorescent,Photograph,1,,,,,,,,,
18480,,2014-018803,SPM031445,"Caloptilia umbratella",None,Iowa,Linn,2012-08-24,,"Wanatee County Park",42.0094,-91.56623,"Jim Durbin",adult,Blacklight/Fluorescent,Photograph,1,,,,,,,,,
18481,,2014-018804,SPM034083,"Caloptilia umbratella",None,Iowa,Linn,2013-06-18,,"Matsell Bridge Natural Area",42.13131,-91.38886,"Jim Durbin",adult,Blacklight/Fluorescent,Photograph,1,,,,,,,,,
18482,,2014-018805,SPM034086,"Caloptilia umbratella",None,Iowa,Linn,2013-06-18,,"Matsell Bridge Natural Area",42.13131,-91.38886,"Jim Durbin",adult,Blacklight/Fluorescent,Photograph,1,,,,,,,,,
18483,,2014-018806,SPM034118,"Caloptilia umbratella",None,Iowa,Linn,2013-06-18,,"Matsell Bridge Natural Area",42.13131,-91.38886,"Jim Durbin",adult,Blacklight/Fluorescent,Photograph,1,,,,,,,,,
126659,,2015-017227,,"Caloptilia umbratella",None,Iowa,Linn,2015-06-08,2100-2315,"Matsell Bridge Natural Area",42.131959,-91.388307,"Jim Durbin",adult,Blacklight/Fluorescent,Photograph,1,77,49,56,0,210,29.78,clear,"55% visible",
126673,,2015-017241,,"Caloptilia umbratella",None,Iowa,Linn,2015-06-08,2100-2315,"Matsell Bridge Natural Area",42.131959,-91.388307,"Jim Durbin",adult,Blacklight/Fluorescent,Photograph,1,77,49,56,0,210,29.78,clear,"55% visible",
128189,,2015-018779,,"Caloptilia umbratella",None,Iowa,Linn,2015-07-16,2100-2300,"Matsell Bridge Natural Area",42.131959,-91.388307,"Jim Durbin",adult,Blacklight/Fluorescent,Photograph,1,75,100,74,2,190,29.74,"partly cloudy",Dark,
170925,,2016-035670,,"Caloptilia umbratella",None,Iowa,Linn,2016-06-24,2045-2300,"Wanatee County Park",42.01026,-91.57381,"Jim Durbin",adult,Blacklight/Fluorescent,Photograph,1,77,69,66,3,100,29.95,clear,"45 % visible","45 % visible"
172975,,2016-037720,,"Caloptilia umbratella",None,Iowa,Linn,2016-07-27,2100-2300,"Matsell Bridge Natural Area",42.131959,-91.388307,"Jim Durbin",adult,Blacklight/Fluorescent,Photograph,1,85,52,66,5,145,29.88,"partly cloudy","50 % visible","Heavy dew"
172979,,2016-037724,,"Caloptilia umbratella",None,Iowa,Linn,2016-07-27,2100-2300,"Matsell Bridge Natural Area",42.131959,-91.388307,"Jim Durbin",adult,Blacklight/Fluorescent,Photograph,1,85,52,66,5,145,29.88,"partly cloudy","50 % visible","Heavy dew"
193045,,2017-011010,,"Caloptilia umbratella",None,Iowa,Linn,2017-07-01,,"Hitaga Sand Ridge Prairie Preserve",42.250957,-91.632098,"Jim Durbin",adult,Blacklight/Fluorescent,Photograph,1,72,56,55,280,9,29.97,clear,,
288438,,,,"Caloptilia umbratella",None,Iowa,Linn,2021-06-12,22:30:57,"Pleasant Creek State Recreation Area, Linn County",42.11007461,-91.82771882,"Jim Durbin",adult,Blacklight/Fluorescent,Photograph,1,78,30,45,4,0,29.88,clear,"10% visible",
288600,,,,"Caloptilia umbratella",None,Iowa,Linn,2021-06-12,21:27:01,"Pleasant Creek State Recreation Area, Linn County",42.11007461,-91.82771882,"Jim Durbin",adult,Blacklight/Fluorescent,Photograph,1,78,30,45,4,0,29.88,clear,"10% visible",
289317,,,,"Caloptilia umbratella",None,Iowa,Linn,2021-06-27,23:18:00,"Pleasant Creek State Recreation Area, Linn County",42.1102396,-91.82752613,"Jim Durbin",adult,Sighting,Photograph,1,74,70,64,0,165,29.92,clear,"90% visible",
289792,,,,"Caloptilia umbratella",None,Iowa,Linn,2021-07-03,22:54:38,"Pinicon Ridge Park",42.21096962,-91.54429747,"Jim Durbin",adult,Blacklight/Fluorescent,Photograph,1,79,57,63,3,190,29.9,clear,"50% visible",
311623,,,,"Caloptilia umbratella",None,Iowa,Linn,2022-07-02,20:34:43,"Wanatee County Park",42.01013441,-91.56662262,"Jim Durbin",adult,Blacklight/Fluorescent,Photograph,1,72,61,58,3,190,30.02,clear,"10% moon",
335133,,,,"Caloptilia umbratella",None,Iowa,Linn,2023-06-17,21:20:12,"Wanatee County Park",42.010114365,-91.566550498333,"Jim Durbin",adult,Blacklight/Fluorescent,Photograph,1,75,54,57,2,90,29.84,c;ear,"no moon",
335143,,,,"Caloptilia umbratella",None,Iowa,Linn,2023-06-17,21:36:21,"Wanatee County Park",42.010114365,-91.566550498333,"Jim Durbin",adult,Blacklight/Fluorescent,Photograph,1,75,54,57,2,90,29.84,c;ear,"no moon",
336478,,,,"Caloptilia umbratella",None,Iowa,Linn,2023-07-03,21:51:41,"Hitaga Sand Ridge Prairie Preserve",42.250717995,-91.632138603333,"Jim Durbin",adult,Blacklight/Fluorescent,Photograph,1,80,77,72,0,0,29.92,clear,"full moon",
337981,,,,"Caloptilia umbratella",None,Iowa,Linn,2023-07-16,22:57:56,"Matsell Bridge Natural Area",42.13217249,-91.38522877,"Jim Durbin",adult,Blacklight/Fluorescent,Photograph,1,73,70,63,4,220,29.87,cloudy,"10% visible",
339005,,,,"Caloptilia umbratella",None,Iowa,Linn,2023-07-30,22:39:00,"Hitaga Sand Ridge Prairie Preserve",42.25109448,-91.63222102,"Jim Durbin",adult,Blacklight/Fluorescent,Photograph,1,75,76,67,0,0,30.08,"mostly clear","95% moon",
