ID,"Collection / Source","Catalog Number","Specify Number",Taxon,"Common Name",State,County,Date,Time,Locale,Latitude,Longitude,Collector,"Life Stage","Collection Method","Preparation Type",Count,Temperature,Humidity,"Dew Point",Wind,"Wind Direction","Barometric Pressure",Sky,"Moon Phase",Notes
11277,"Jim Durbin Drawer 007",2014-011559,SPM030091,"Dichomeris ligulella","Palmerworm Moth",Iowa,Linn,2012-07-12,,"Wanatee County Park",42.0094,-91.56623,"Jim Durbin",adult,Blacklight/Fluorescent,Pinned,1,,,,,,,,,
17893,,2014-018193,SPM022965,"Dichomeris ligulella","Palmerworm Moth",Iowa,Linn,2011-07-10,,"Wickiup Hill Outdoor Learning Area",42.08398,-91.7651,"Jim Durbin",adult,Blacklight/Fluorescent,Photograph,1,,,,,,,,,
20491,,2014-020828,SPM031046,"Dichomeris ligulella","Palmerworm Moth",Iowa,Linn,2012-07-27,,"Wanatee County Park",42.0094,-91.56623,"Jim Durbin",adult,Blacklight/Fluorescent,Photograph,1,,,,,,,,,
23656,"Jim Durbin Drawer 007",2014-024002,SPM014342,"Dichomeris ligulella","Palmerworm Moth",Iowa,Linn,2009-07-11,,"Wickiup Hill Outdoor Learning Area",42.08398,-91.7651,"Jim Durbin",adult,Blacklight/Fluorescent,Pinned,1,,,,,,,,,
23657,"Jim Durbin Drawer 007",2014-024003,SPM014343,"Dichomeris ligulella","Palmerworm Moth",Iowa,Linn,2009-07-11,,"Wickiup Hill Outdoor Learning Area",42.08398,-91.7651,"Jim Durbin",adult,Blacklight/Fluorescent,Pinned,1,,,,,,,,,
23658,"Jim Durbin Drawer 007",2014-024004,SPM014688,"Dichomeris ligulella","Palmerworm Moth",Iowa,Linn,2009-07-24,,"Wanatee County Park",42.0094,-91.56623,"Jim Durbin",adult,Blacklight/Fluorescent,Pinned,1,,,,,,,,,
23661,"Jim Durbin Drawer 007",2014-024007,SPM018257,"Dichomeris ligulella","Palmerworm Moth",Iowa,Linn,2010-06-29,,"Wickiup Hill Outdoor Learning Area",42.08398,-91.7651,"Jim Durbin",adult,Blacklight/Fluorescent,Pinned,1,,,,,,,,,
23662,"Jim Durbin Drawer 007",2014-024008,SPM018408,"Dichomeris ligulella","Palmerworm Moth",Iowa,Linn,2010-07-10,,"Wanatee County Park",42.01026,-91.57381,"Jim Durbin",adult,Blacklight/Fluorescent,Pinned,1,,,,,,,,,
23664,"Jim Durbin Drawer 007",2014-024010,SPM019237,"Dichomeris ligulella","Palmerworm Moth",Iowa,Linn,2010-07-16,,"1460 Douglas Ct, Marion",42.040069,-91.590953,"Jim Durbin",adult,Blacklight/Fluorescent,Pinned,1,,,,,,,,,
23665,"Jim Durbin Drawer 007",2014-024011,SPM022759,"Dichomeris ligulella","Palmerworm Moth",Iowa,Linn,2011-07-06,,"Wanatee County Park",42.0094,-91.56623,"Jim Durbin",adult,Blacklight/Fluorescent,Pinned,1,,,,,,,,,
23666,"Jim Durbin Drawer 007",2014-024012,SPM022760,"Dichomeris ligulella","Palmerworm Moth",Iowa,Linn,2011-07-06,,"Wanatee County Park",42.0094,-91.56623,"Jim Durbin",adult,Blacklight/Fluorescent,Pinned,1,,,,,,,,,
23667,"Jim Durbin Drawer 007",2014-024013,SPM023040,"Dichomeris ligulella","Palmerworm Moth",Iowa,Linn,2011-07-16,,"Wanatee County Park",42.0094,-91.56623,"Jim Durbin",adult,Blacklight/Fluorescent,Pinned,1,,,,,,,,,
23668,,2014-024014,SPM023058,"Dichomeris ligulella","Palmerworm Moth",Iowa,Linn,2011-07-16,,"Wanatee County Park",42.0094,-91.56623,"Jim Durbin",adult,Blacklight/Fluorescent,Photograph,1,,,,,,,,,
23669,,2014-024015,SPM023064,"Dichomeris ligulella","Palmerworm Moth",Iowa,Linn,2011-07-16,,"Wanatee County Park",42.0094,-91.56623,"Jim Durbin",adult,Blacklight/Fluorescent,Photograph,1,,,,,,,,,
23670,"Jim Durbin Drawer 007",2014-024016,SPM023140,"Dichomeris ligulella","Palmerworm Moth",Iowa,Linn,2011-08-06,,"Wanatee County Park",42.0094,-91.56623,"Jim Durbin",adult,Blacklight/Fluorescent,Pinned,1,,,,,,,,,
23673,"Jim Durbin Drawer 007",2014-024019,SPM030955,"Dichomeris ligulella","Palmerworm Moth",Iowa,Linn,2012-07-27,,"Wanatee County Park",42.0094,-91.56623,"Jim Durbin",adult,Blacklight/Fluorescent,Pinned,1,,,,,,,,,
23705,"Jim Durbin Drawer 007",2014-024051,SPM014339,"Dichomeris ligulella","Palmerworm Moth",Iowa,Linn,2009-07-11,,"Wickiup Hill Outdoor Learning Area",42.08398,-91.7651,"Jim Durbin",adult,Blacklight/Fluorescent,Pinned,1,,,,,,,,,
36575,"Jim Durbin Drawer 007",2014-036949,SPM033640,"Dichomeris ligulella","Palmerworm Moth",Iowa,Linn,2013-05-14,,"Matsell Bridge Natural Area",42.13131,-91.38886,"Jim Durbin",adult,Blacklight/Fluorescent,Pinned,1,,,,,,,,,
166995,,2016-031740,,"Dichomeris ligulella","Palmerworm Moth",Iowa,Linn,2016-05-19,,"Hitaga Sand Ridge Prairie Preserve",42.250957,-91.632098,"Jim Durbin",adult,Blacklight/Florescent,Photograph,1,59,63,46,0,110,30.06,Clear,"95% visible",
172191,,2016-036936,,"Dichomeris ligulella","Palmerworm Moth",Iowa,Linn,2016-07-20,2100-2330,"Hitaga Sand Ridge Prairie Preserve",42.250957,-91.632098,"Jim Durbin",adult,Blacklight/Fluorescent,Photograph,1,81,90,77,5,180,30.01,cloudy,full,
172923,,2016-037668,,"Dichomeris ligulella","Palmerworm Moth",Iowa,Linn,2016-07-24,,"Hitaga Sand Ridge Prairie Preserve",42.250957,-91.632098,"Jim Durbin",adult,Blacklight/Fluorescent,Photograph,1,77,70,66,,300,29.9,"partly cloudy","90% visible",
174122,,2016-038877,,"Dichomeris ligulella","Palmerworm Moth",Iowa,Linn,2016-08-09,2030-2300,"Hitaga Sand Ridge Prairie Preserve",42.250957,-91.632098,"Jim Durbin",adult,Blacklight/Fluorescent,Photograph,1,79,79,71,0,0,29.96,clear,"40% visible",
174532,,2016-039282,,"Dichomeris ligulella","Palmerworm Moth",Iowa,Linn,2016-08-15,2030-2300,"Hitaga Sand Ridge Prairie Preserve",42.250957,-91.632098,"Jim Durbin",adult,Blacklight/Fluorescent,Photograph,1,75,74,66,0,0,29096,cloudy,full,
192875,,2017-010840,,"Dichomeris ligulella","Palmerworm Moth",Iowa,Linn,2017-06-24,2045-2300,"Hitaga Sand Ridge Prairie Preserve",42.250957,-91.632098,"Jim Durbin",adult,Blacklight/Fluorescent,Photograph,1,65,43,46,13,280,30.14,clear,new,
193773,,2017-011764,,"Dichomeris ligulella","Palmerworm Moth",Iowa,Linn,2014-07-13,2045-2330,"Hitaga Sand Ridge Prairie Preserve",42.250957,-91.632098,"Jim Durbin",adult,Blacklight/Fluorescent,Photograph,1,74,67,63,3,300,,"partly cloudy",,
194556,,2017-012521,,"Dichomeris ligulella","Palmerworm Moth",Iowa,Linn,2017-07-29,2045-2315,"Hitaga Sand Ridge Prairie Preserve",42.250957,-91.632098,"Jim Durbin",adult,Blacklight/Fluorescent,Photograph,1,69,73,61,0,0,30.09,clear,"40% visible",
194565,,2017-012530,,"Dichomeris ligulella","Palmerworm Moth",Iowa,Linn,2017-07-29,2045-2315,"Hitaga Sand Ridge Prairie Preserve",42.250957,-91.632098,"Jim Durbin",adult,Blacklight/Fluorescent,Photograph,1,69,73,61,0,0,30.09,clear,"40% visible",
194598,,2017-012563,,"Dichomeris ligulella","Palmerworm Moth",Iowa,Linn,2017-07-29,2045-2315,"Hitaga Sand Ridge Prairie Preserve",42.250957,-91.632098,"Jim Durbin",adult,Blacklight/Fluorescent,Photograph,1,69,73,61,0,0,30.09,clear,"40% visible",
194599,,2017-012564,,"Dichomeris ligulella","Palmerworm Moth",Iowa,Linn,2017-07-29,2045-2315,"Hitaga Sand Ridge Prairie Preserve",42.250957,-91.632098,"Jim Durbin",adult,Blacklight/Fluorescent,Photograph,1,69,73,61,0,0,30.09,clear,"40% visible",
194619,,2017-012584,,"Dichomeris ligulella","Palmerworm Moth",Iowa,Linn,2017-07-29,2045-2315,"Hitaga Sand Ridge Prairie Preserve",42.250957,-91.632098,"Jim Durbin",adult,Blacklight/Fluorescent,Photograph,1,69,73,61,0,0,30.09,clear,"40% visible",
195656,,2017-013620,,"Dichomeris ligulella","Palmerworm Moth",Iowa,Linn,2017-08-18,2030-2300,"Wickiup Hill Outdoor Learning Area",42.087567,-91.767578,"Jim Durbin",adult,Blacklight/Fluorescent,Photograph,1,71,73,62,5,10,29.88,clear,"20% visible",
209713,,2018-007870,,"Dichomeris ligulella","Palmerworm Moth",Iowa,Linn,2018-05-04,"2030 - 2300","Wickiup Hill Outdoor Learning Area",42.087352,-91.767107,"Jim Durbin",adult,Blacklight/Fluorescent,Photograph,1,67,38,41,0,0,29.95,clear,"95% visible",
210106,"Jim Durbin Drawer 007",2018-008263,,"Dichomeris ligulella","Palmerworm Moth",Iowa,Linn,2018-05-09,"2030 to 2300","Hitaga Sand Ridge Prairie Preserve",42.250957,-91.632098,"Jim Durbin",adult,Blacklight/Fluorescent,Pinned,1,66,75,58,6,275,29.78,clear,"50 % visible",
210139,,2018-008296,,"Dichomeris ligulella","Palmerworm Moth",Iowa,Linn,2018-05-09,"2030 to 2300","Hitaga Sand Ridge Prairie Preserve",42.250957,-91.632098,"Jim Durbin",adult,Blacklight/Fluorescent,Photograph,1,66,75,58,6,275,29.78,clear,"50 % visible",
210164,,2018-008321,,"Dichomeris ligulella","Palmerworm Moth",Iowa,Linn,2018-05-09,"2030 to 2300","Hitaga Sand Ridge Prairie Preserve",42.250957,-91.632098,"Jim Durbin",adult,Blacklight/Fluorescent,Photograph,1,66,75,58,6,275,29.78,clear,"50 % visible",
210166,,2018-008323,,"Dichomeris ligulella","Palmerworm Moth",Iowa,Linn,2018-05-09,"2030 to 2300","Hitaga Sand Ridge Prairie Preserve",42.250957,-91.632098,"Jim Durbin",adult,Blacklight/Fluorescent,Photograph,1,66,75,58,6,275,29.78,clear,"50 % visible",
210171,,2018-008328,,"Dichomeris ligulella","Palmerworm Moth",Iowa,Linn,2018-05-09,"2030 to 2300","Hitaga Sand Ridge Prairie Preserve",42.250957,-91.632098,"Jim Durbin",adult,Blacklight/Fluorescent,Photograph,1,66,75,58,6,275,29.78,clear,"50 % visible",
210182,,2018-008339,,"Dichomeris ligulella","Palmerworm Moth",Iowa,Linn,2018-05-09,"2030 to 2300","Hitaga Sand Ridge Prairie Preserve",42.250957,-91.632098,"Jim Durbin",adult,Blacklight/Fluorescent,Photograph,1,66,75,58,6,275,29.78,clear,"50 % visible",
210195,,2018-008352,,"Dichomeris ligulella","Palmerworm Moth",Iowa,Linn,2018-05-09,"2030 to 2300","Hitaga Sand Ridge Prairie Preserve",42.250957,-91.632098,"Jim Durbin",adult,Blacklight/Fluorescent,Photograph,1,66,75,58,6,275,29.78,clear,"50 % visible",
210219,,2018-008376,,"Dichomeris ligulella","Palmerworm Moth",Iowa,Linn,2018-05-09,"2030 to 2300","Hitaga Sand Ridge Prairie Preserve",42.250957,-91.632098,"Jim Durbin",adult,Blacklight/Fluorescent,Photograph,1,66,75,58,6,275,29.78,clear,"50 % visible",
210234,,2018-008391,,"Dichomeris ligulella","Palmerworm Moth",Iowa,Linn,2018-05-16,"2030 to 2300","Wanatee County Park",42.01026,-91.57381,"Jim Durbin",adult,Blacklight/Fluorescent,Photograph,1,72,45,50,1,100,29.86,clear,"0 visible",
210264,,2018-008421,,"Dichomeris ligulella","Palmerworm Moth",Iowa,Linn,2018-05-16,"2030 to 2300","Wanatee County Park",42.01026,-91.57381,"Jim Durbin",adult,Blacklight/Fluorescent,Photograph,1,72,45,50,1,100,29.86,clear,"0 visible",
210284,,2018-008441,,"Dichomeris ligulella","Palmerworm Moth",Iowa,Linn,2018-05-16,"2030 to 2300","Wanatee County Park",42.01026,-91.57381,"Jim Durbin",adult,Blacklight/Fluorescent,Photograph,1,72,45,50,1,100,29.86,clear,"0 visible",
212257,,2018-010413,,"Dichomeris ligulella","Palmerworm Moth",Iowa,Linn,2018-06-15,2100-2315,"Wickiup Hill Outdoor Learning Area",42.087352,-91.767107,"Jim Durbin",adult,Blacklight/Florescent,Photograph,1,84,70,73,3,120,29.79,"partly cloudy","0 % visible",
212615,,2018-010772,,"Dichomeris ligulella","Palmerworm Moth",Iowa,Linn,2018-06-23,2100-2330,"Hitaga Sand Ridge Prairie Preserve",42.250957,-91.632098,"Jim Durbin",adult,Blacklight/Fluorescent,Photograph,1,68,85,63,5,180,29.81,"partly cloudy","80% visible",
212618,,2018-010775,,"Dichomeris ligulella","Palmerworm Moth",Iowa,Linn,2018-06-23,2100-2330,"Hitaga Sand Ridge Prairie Preserve",42.250957,-91.632098,"Jim Durbin",adult,Blacklight/Fluorescent,Photograph,1,68,85,63,5,180,29.81,"partly cloudy","80% visible",
213303,,2018-011459,,"Dichomeris ligulella","Palmerworm Moth",Iowa,Linn,2018-06-27,2100-2330,"Matsell Bridge Natural Area",42.132148,-91.385221,"Jim Durbin",adult,Blacklight/Fluorescent,Photograph,1,80,59,64,0,0,29.77,"partly cloudy",Full,"extremely heavy dew"
213867,,2018-012023,,"Dichomeris ligulella","Palmerworm Moth",Iowa,Linn,2018-07-03,2100-2330,"Wickiup Hill Outdoor Learning Area",42.087352,-91.767107,"Jim Durbin",adult,Blacklight/Fluorescent,Photograph,1,82,68,70,4,90,29.96,Clear,"80 % visible",
214448,,2018-012604,,"Dichomeris ligulella","Palmerworm Moth",Iowa,Linn,2018-07-09,2100-2330,"Hitaga Sand Ridge Prairie Preserve",42.250957,-91.632098,"Jim Durbin",adult,Blacklight/Fluorescent,Photograph,1,80,79,73,0,0,30.11,clear,"20% visible",
216219,,2018-014375,,"Dichomeris ligulella","Palmerworm Moth",Iowa,Linn,2018-07-23,2100-2300,"Hitaga Sand Ridge Prairie Preserve",42.250957,-91.632098,"Jim Durbin",adult,Blacklight/Fluorescent,Photograph,1,78,62,64,1,275,29.98,clear,"80% visible",
217058,,2018-015214,,"Dichomeris ligulella","Palmerworm Moth",Iowa,Linn,2018-08-01,"2045-2215. Quit early because of storms.","Wickiup Hill Outdoor Learning Area",42.087352,-91.767107,"Jim Durbin",adult,Blacklight/Fluorescent,Photograph,1,77,52,58,1,180,29.97,cloudy,"95% visible",
219486,,2018-017642,,"Dichomeris ligulella","Palmerworm Moth",Iowa,Linn,2018-08-25,2015-2300,"Hitaga Sand Ridge Prairie Preserve",42.250604,-91.629962,"Jim Durbin",adult,Blacklight/Fluorescent,Photograph,1,74,97,73,3,310,29.91,cdlear,"Full Moon",
228120,,2019-002842,,"Dichomeris ligulella","Palmerworm Moth",Iowa,Linn,2010-05-02,,"Wanatee County Park",42.0094,-91.56623,"Jim Durbin",adult,Blacklight/Fluorescent,Photograph,1,,,,,,,,,
233633,,2019-008345,,"Dichomeris ligulella","Palmerworm Moth",Iowa,Linn,2019-07-07,2100-2315,"Hitaga Sand Ridge Prairie Preserve",42.250957,-91.632098,"Jim Durbin",adult,Blacklight/Fluorescent,Photograph,1,72,59,62,2,90,29.84,"parthly cloudy","10 % visible",
234649,,,,"Dichomeris ligulella","Palmerworm Moth",Iowa,Linn,2019-07-29,2100-2315,"Wickiup Hill Outdoor Learning Area",42.087352,-91.767107,"Jim Durbin",adult,Blacklight/Fluorescent,Photograph,1,74,58,59,3,270,29.9,clear,"10% visible",
235495,,,,"Dichomeris ligulella","Palmerworm Moth",Iowa,Linn,2019-08-08,2030-2315,"Pleasant Creek State Recreation Area, Linn County",42.109891,-91.826883,"Jim Durbin",adult,Blacklight/Fluorescent,Photograph,1,73,54,55,0,0,29.86,clear,"40% visible",
235687,,,,"Dichomeris ligulella","Palmerworm Moth",Iowa,Linn,2019-08-11,2030-2300,"Wickiup Hill Outdoor Learning Area",42.087343,-91.767109,"Jim Durbin",adult,Sighting,Photograph,1,75,90,72,4,90,29.81,"parthly cloudy","90% visible",
235751,,,,"Dichomeris ligulella","Palmerworm Moth",Iowa,Linn,2019-08-11,2030-2300,"Wickiup Hill Outdoor Learning Area",42.087343,-91.767109,"Jim Durbin",adult,Sighting,Photograph,1,75,90,72,4,90,29.81,"parthly cloudy","90% visible",
235805,,,,"Dichomeris ligulella","Palmerworm Moth",Iowa,Linn,2019-08-11,2030-2300,"Wickiup Hill Outdoor Learning Area",42.087343,-91.767109,"Jim Durbin",adult,Sighting,Photograph,1,75,90,72,4,90,29.81,"parthly cloudy","90% visible",
236076,,,,"Dichomeris ligulella","Palmerworm Moth",Iowa,Linn,2019-08-14,2030-2300,"Hitaga Sand Ridge Prairie Preserve",42.250886,-91.632106,"Jim Durbin",adult,Sighting,Photograph,1,68,89,65,2,260,29.91,"partly cloidy",full,
236222,,,,"Dichomeris ligulella","Palmerworm Moth",Iowa,Linn,2019-08-14,2030-2300,"Hitaga Sand Ridge Prairie Preserve",42.250886,-91.632106,"Jim Durbin",adult,Sighting,Photograph,10,68,89,65,2,260,29.91,"partly cloidy",full,
236263,,,,"Dichomeris ligulella","Palmerworm Moth",Iowa,Linn,2019-08-17,2030-2300,"Hitaga Sand Ridge Prairie Preserve",42.25226,-91.63040167,"Jim Durbin",adult,Blacklight/Fluorescent,Photograph,1,79,62,65,1,180,29.71,"parthly cloudy","Full Moon",
236931,,,,"Dichomeris ligulella","Palmerworm Moth",Iowa,Linn,2019-08-24,2030-2300,"Hitaga Sand Ridge Prairie Preserve",42.250957,-91.632098,"Jim Durbin",adult,Blacklight/Fluorescent,Photograph,1,65,71,56,2,90,30.01,"partly cloudy","50% visible",
236983,,,,"Dichomeris ligulella","Palmerworm Moth",Iowa,Linn,2019-08-24,2030-2300,"Hitaga Sand Ridge Prairie Preserve",42.250957,-91.632098,"Jim Durbin",adult,Blacklight/Fluorescent,Photograph,1,65,71,56,2,90,30.01,"partly cloudy","50% visible",
237686,,,,"Dichomeris ligulella","Palmerworm Moth",Iowa,Linn,2019-08-24,2030-2300,"Hitaga Sand Ridge Prairie Preserve",42.250957,-91.632098,"Jim Durbin",adult,Blacklight/Fluorescent,Photograph,1,65,71,56,2,90,30.01,"partly cloudy","50% visible",
264337,,,,"Dichomeris ligulella","Palmerworm Moth",Iowa,Linn,2020-05-03,22:03:04,"Wickiup Hill Outdoor Learning Area",42.087605,-91.76766,"Jim Durbin",adult,Blacklight/Fluorescent,Photograph,1,66,,,,,,"partly cloudy","90% visible",
264521,,,,"Dichomeris ligulella","Palmerworm Moth",Iowa,Linn,2020-05-15,,"Hitaga Sand Ridge Prairie Preserve",42.250881,-91.632144,"Jim Durbin",adult,Blacklight/Fluorescent,Photograph,1,60,85,56,0,0,30.01,clear,"50% visible",
265102,,,,"Dichomeris ligulella","Palmerworm Moth",Iowa,Linn,2020-05-27,21:31:32,"Matsell Bridge Natural Area",42.13204088,-91.38537304,"Jim Durbin",adult,Blacklight/Fluorescent,Photograph,1,73,94,72,0,280,29.89,cloudy,"10% visible",
267784,,,,"Dichomeris ligulella","Palmerworm Moth",Iowa,Linn,2020-06-28,23:00:35,"Wickiup Hill Outdoor Learning Area",42.08735076,-91.76706884,"Jim Durbin",adult,Blacklight/Fluorescent,Photograph,1,78,76,70,4,110,29.57,clear,"50% visible",
267890,,,,"Dichomeris ligulella","Palmerworm Moth",Iowa,Linn,2020-06-28,22:15:07,"Wickiup Hill Outdoor Learning Area",42.08735076,-91.76706884,"Jim Durbin",adult,Blacklight/Fluorescent,Photograph,1,78,76,70,4,110,29.57,clear,"50% visible",
268285,,,,"Dichomeris ligulella","Palmerworm Moth",Iowa,Linn,2020-06-30,22:10:08,"Hitaga Sand Ridge Prairie Preserve",42.25088735,-91.63212362,"Jim Durbin",adult,Blacklight/Fluorescent,Photograph,1,78,88,74,2,100,29.85,cloudy,"80% visible",
268287,,,,"Dichomeris ligulella","Palmerworm Moth",Iowa,Linn,2020-06-30,22:10:00,"Hitaga Sand Ridge Prairie Preserve",42.25088735,-91.63212362,"Jim Durbin",adult,Blacklight/Fluorescent,Photograph,1,78,88,74,2,100,29.85,cloudy,"80% visible",
268359,,,,"Dichomeris ligulella","Palmerworm Moth",Iowa,Linn,2020-06-30,21:50:40,"Hitaga Sand Ridge Prairie Preserve",42.25088735,-91.63212362,"Jim Durbin",adult,Blacklight/Fluorescent,Photograph,1,78,88,74,2,100,29.85,cloudy,"80% visible",
268879,,,,"Dichomeris ligulella","Palmerworm Moth",Iowa,Linn,2020-07-24,22:12:04,"Wickiup Hill Outdoor Learning Area",42.08807239,-91.76755076,"Jim Durbin",adult,Blacklight/Fluorescent,Photograph,1,80,76,72,4,120,29.6,clear,"20% visible",
269225,,,,"Dichomeris ligulella","Palmerworm Moth",Iowa,Linn,2020-07-30,22:51:01,"Matsell Bridge Natural Area",42.1321277,-91.38531247,"Jim Durbin",adult,Blacklight/Fluorescent,Photograph,1,77,75,68,6,45,29.88,"partly cloudy","80% visible",
269701,,,,"Dichomeris ligulella","Palmerworm Moth",Iowa,Linn,2020-08-08,22:52:12,"Hitaga Sand Ridge Prairie Preserve",42.25088607,-91.63213435,"Jim Durbin",adult,Blacklight/Fluorescent,Photograph,1,78,81,71,7,180,30.02,clear,"80% visible",
269842,,,,"Dichomeris ligulella","Palmerworm Moth",Iowa,Linn,2020-08-08,21:58:53,"Hitaga Sand Ridge Prairie Preserve",42.25088607,-91.63213435,"Jim Durbin",adult,Blacklight/Fluorescent,Photograph,1,78,81,71,7,180,30.02,clear,"80% visible",
287900,,,,"Dichomeris ligulella","Palmerworm Moth",Iowa,Linn,2021-05-24,22:33:14,"Matsell Bridge Natural Area",42.13218947,-91.38528806,"Jim Durbin",adult,Blacklight/Fluorescent,Photograph,1,76,77,68,4,190,30,Cloudy,"full moon",
288906,,,,"Dichomeris ligulella","Palmerworm Moth",Iowa,Linn,2021-06-18,22:10:47,"Hitaga Sand Ridge Prairie Preserve",42.25091805,-91.63221484,"Jim Durbin",adult,Blacklight/Fluorescent,Photograph,1,84,46,61,4,180,29.75,"partly cloudy","50% visible",
296862,"Jim Durbin Drawer 007",2021-000138,,"Dichomeris ligulella","Palmerworm Moth",Iowa,Linn,2014-05-26,,"Wanatee County Park",42.00891,-91.568567,"Jim Durbin",adult,Blacklight/Florescent,Pinned,1,,,,,,,,,
296863,"Jim Durbin Drawer 007",2021-000141,,"Dichomeris ligulella","Palmerworm Moth",Iowa,Linn,2014-05-07,,"Matsell Bridge Natural Area",42.132325,-91.38528,"Jim Durbin",adult,Blacklight/Florescent,Pinned,1,,,,,,,,,
312619,,,,"Dichomeris ligulella","Palmerworm Moth",Iowa,Linn,2022-07-26,22:15:17,"Hitaga Sand Ridge Prairie Preserve",42.25103779,-91.63215575,"Jim Durbin",adult,Blacklight/Fluorescent,Photograph,1,76,79,69,1,170,29.91,cloudy,"10% moon",
334432,,,,"Dichomeris ligulella","Palmerworm Moth",Iowa,Linn,2023-05-15,22:01:06,"Wanatee County Park",42.01004004666667,-91.56646889666666,"Jim Durbin",adult,Blacklight/Fluorescent,Photograph,1,,,,0,,,,,
334445,,,,"Dichomeris ligulella","Palmerworm Moth",Iowa,Linn,2023-05-15,21:47:11,"Wanatee County Park",42.01004004666667,-91.56646889666666,"Jim Durbin",adult,Blacklight/Fluorescent,Photograph,1,,,,0,,,,,
336534,,,,"Dichomeris ligulella","Palmerworm Moth",Iowa,Linn,2023-07-03,22:05:08,"Hitaga Sand Ridge Prairie Preserve",42.250717995,-91.632138603333,"Jim Durbin",adult,Blacklight/Fluorescent,Photograph,1,80,77,72,0,0,29.92,clear,"full moon",
336743,,,,"Dichomeris ligulella","Palmerworm Moth",Iowa,Linn,2023-07-02,22:49:26,"1460 Douglas Ct, Marion",42.040098668333,-91.590915611667,"Jim Durbin",adult,Blacklight/Fluorescent,Photograph,1,,,,,,,,,
338962,,,,"Dichomeris ligulella","Palmerworm Moth",Iowa,Linn,2023-07-30,22:09:21,"Hitaga Sand Ridge Prairie Preserve",42.25109448,-91.63222102,"Jim Durbin",adult,Blacklight/Fluorescent,Photograph,1,75,76,67,0,0,30.08,"mostly clear","95% moon",
339054,,,,"Dichomeris ligulella","Palmerworm Moth",Iowa,Linn,2023-07-30,22:49:35,"Hitaga Sand Ridge Prairie Preserve",42.25109448,-91.63222102,"Jim Durbin",adult,Blacklight/Fluorescent,Photograph,1,75,76,67,0,0,30.08,"mostly clear","95% moon",
