ID,"Collection / Source","Catalog Number","Specify Number",Taxon,"Common Name",State,County,Date,Time,Locale,Latitude,Longitude,Collector,"Life Stage","Collection Method","Preparation Type",Count,Temperature,Humidity,"Dew Point",Wind,"Wind Direction","Barometric Pressure",Sky,"Moon Phase",Notes
175059,,2016-039809,,"Gyponana octolineata",None,Iowa,Linn,2016-08-28,2000-2230,"Hitaga Sand Ridge Prairie Preserve",42.250957,-91.632098,"Jim Durbin",adult,Blacklight/Fluorescent,Photograph,1,74,83,74,9,110,30.1,cloudy,"10% visible","Rained for about 15 minutes at 8:00PM"
196381,,2017-014315,,"Gyponana octolineata",None,Iowa,Linn,2017-09-14,1945-2230,"Hitaga Sand Ridge Prairie Preserve",42.250957,-91.632098,"Jim Durbin",adult,Blacklight/Fluorescent,Photograph,1,76,68,66,4,145,29.85,cloudy,"40 % visible",
220215,,2018-018371,,"Gyponana octolineata",None,Iowa,Linn,2018-09-11,1945-2300,"Hitaga Sand Ridge Prairie Preserve",42.25095,-91.63209,"Jim Durbin",adult,Blacklight/Fluorescent,Photograph,1,73,64,60,2,110,30.02,clear,dark,
238618,,,,"Gyponana octolineata",None,Iowa,Linn,2019-09-30,1915-2200,"Hitaga Sand Ridge Prairie Preserve",42.250957,-91.632098,"Jim Durbin",adult,Blacklight/Fluorescent,Photograph,1,81,67,69,13,185,29.64,Clear,"0% visible",
238628,,,,"Gyponana octolineata",None,Iowa,Linn,2019-09-30,1915-2200,"Hitaga Sand Ridge Prairie Preserve",42.250957,-91.632098,"Jim Durbin",adult,Blacklight/Fluorescent,Photograph,1,81,67,69,13,185,29.64,Clear,"0% visible",
238645,,,,"Gyponana octolineata",None,Iowa,Linn,2019-09-30,1915-2200,"Hitaga Sand Ridge Prairie Preserve",42.250957,-91.632098,"Jim Durbin",adult,Blacklight/Fluorescent,Photograph,1,81,67,69,13,185,29.64,Clear,"0% visible",
238678,,,,"Gyponana octolineata",None,Iowa,Linn,2019-09-30,1915-2200,"Hitaga Sand Ridge Prairie Preserve",42.250957,-91.632098,"Jim Durbin",adult,Blacklight/Fluorescent,Photograph,1,81,67,69,13,185,29.64,Clear,"0% visible",
238684,,,,"Gyponana octolineata",None,Iowa,Linn,2019-09-30,1915-2200,"Hitaga Sand Ridge Prairie Preserve",42.250957,-91.632098,"Jim Durbin",adult,Blacklight/Fluorescent,Photograph,1,81,67,69,13,185,29.64,Clear,"0% visible",
339014,,,,"Gyponana geminata",None,Iowa,Linn,2023-07-30,22:40:37,"Hitaga Sand Ridge Prairie Preserve",42.25109448,-91.63222102,"Jim Durbin",adult,Blacklight/Fluorescent,Photograph,1,75,76,67,0,0,30.08,"mostly clear","95% moon",
341357,,,,"Gyponana octolineata",None,Iowa,Linn,2023-09-05,20:40:28,"Wanatee County Park",42.010077715,-91.566528441667,"Jim Durbin",adult,Blacklight/Fluorescent,Photograph,1,84,63,70,13,180,29.73,cloudy,"80% moon",
341674,,,,"Gyponana octolineata",None,Iowa,Linn,2023-10-01,20:38:33,"Palisades Kepler State Park",41.90828729,-91.50237809,"Jim Durbin",adult,Blacklight/Fluorescent,Photograph,1,81,50,57,11,160,30.15,clear,"50% visible",
341694,,,,"Gyponana octolineata",None,Iowa,Linn,2023-10-01,21:03:14,"Palisades Kepler State Park",41.90828729,-91.50237809,"Jim Durbin",adult,Blacklight/Fluorescent,Photograph,1,81,50,57,11,160,30.15,clear,"50% visible",
341712,,,,"Gyponana octolineata",None,Iowa,Linn,2023-10-01,21:58:18,"Palisades Kepler State Park",41.90828729,-91.50237809,"Jim Durbin",adult,Blacklight/Fluorescent,Photograph,1,81,50,57,11,160,30.15,clear,"50% visible",
341782,,,,"Gyponana octolineata",None,Iowa,Linn,2023-09-29,20:42:28,"Hitaga Sand Ridge Prairie Preserve",42.250745948333,-91.632190941667,"Jim Durbin",adult,Blacklight/Fluorescent,Photograph,1,78,75,65,9,160,30.03,clear,,
