ID,"Collection / Source","Catalog Number","Specify Number",Taxon,"Common Name",State,County,Date,Time,Locale,Latitude,Longitude,Collector,"Life Stage","Collection Method","Preparation Type",Count,Temperature,Humidity,"Dew Point",Wind,"Wind Direction","Barometric Pressure",Sky,"Moon Phase",Notes
219818,,2018-018245,,"Acmaeodera tubulus",None,Iowa,Lucas,2018-05-26,,"Stephens State Forest - Woodburn Unit",40.96446,-93.579119,"Mark Brown",adult,,Photograph,1,,,,,,,,,
301345,,,,"Megacyllene decora","Amorpha Borer",Iowa,Lucas,2021-09-05,,"Pin Oak Marsh",40.984912,-93.305173,"Jay Gilliam",adult,Sighting,Photograph,1,,,,,,,,,"Pin Oak Marsh
"
319747,,,,"Lixus scrobicollis",None,Iowa,Lucas,2022-05-22,,"Stephens State Forest- Mine Pond",41.016084,-93.479874,"Jay Gilliam",adult,Sighting,Photograph,1,,,,,,,,,
319906,,,,"Cicindela sexguttata","Six-spotted Tiger Beetle",Iowa,Lucas,2022-06-05,,"Stephens State Forest- Mine Pond",41.016084,-93.479874,"Jay Gilliam",adult,Sighting,Photograph,1,,,,,,,,,
342094,,,,"Caenocara undetermined",None,Iowa,Lucas,2023-06-03,,"Red Haw State Park",41.00142,-93.277081,"Mark Brown",adult,Sighting,Photograph,1,,,,,,,,,
342095,,,,"Ptosima gibbicollis","Redbud Borer",Iowa,Lucas,2023-06-03,,"Red Haw State Park",41.00142,-93.277081,"Mark Brown",adult,Sighting,Photograph,1,,,,,,,,,
342098,,,,"Canthon viridis",None,Iowa,Lucas,2023-06-03,,"Red Haw State Park",41.00142,-93.277081,"Mark Brown",adult,Sighting,Photograph,1,,,,,,,,,
342099,,,,"Coleothorpa dominicana",None,Iowa,Lucas,2023-06-03,,"Red Haw State Park",41.00142,-93.277081,"Mark Brown",adult,Sighting,Photograph,1,,,,,,,,,
342100,,,,"Harmonia axyridis","Multicolored Asian Lady Beetle",Iowa,Lucas,2023-06-03,,"Red Haw State Park",41.00142,-93.277081,"Mark Brown",larva,Sighting,Photograph,1,,,,,,,,,
342101,,,,"Brachys ovatus",None,Iowa,Lucas,2023-06-03,,"Red Haw State Park",41.00142,-93.277081,"Mark Brown",adult,Sighting,Photograph,1,,,,,,,,,
342102,,,,"Brachys aerosus",None,Iowa,Lucas,2023-06-03,,"Red Haw State Park",41.00142,-93.277081,"Mark Brown",adult,Sighting,Photograph,1,,,,,,,,,
342104,,,,"Trichosirocalus horridus","Thistle Crown Weevil",Iowa,Lucas,2023-06-03,,"Red Haw State Park",41.00142,-93.277081,"Mark Brown",adult,Sighting,Photograph,1,,,,,,,,,
342106,,,,"Sphenophorus venatus",None,Iowa,Lucas,2023-06-03,,"Stephens State Forest - Thousand Acre Unit, Lucas County",41.103785,-93.103616,"Mark Brown",adult,Sighting,Photograph,1,,,,,,,,,
342107,,,,"Tanymecus confusus",None,Iowa,Lucas,2023-06-03,,"Stephens State Forest - Thousand Acre Unit, Lucas County",41.103785,-93.103616,"Mark Brown",adult,Sighting,Photograph,1,,,,,,,,,
342110,,,,"Calligrapha bidenticola",None,Iowa,Lucas,2023-06-03,,"Stephens State Forest - Thousand Acre Unit, Lucas County",41.103785,-93.103616,"Mark Brown",adult,Sighting,Photograph,1,,,,,,,,,
342423,,,,"Brachys aerosus",None,Iowa,Lucas,2023-06-03,09:25:35,"Red Haw State Park",41.00160779,-93.27816916166667,"Mark Brown",adult,Sighting,Photograph,1,,,,,,,,,
342427,,,,"Cycloneda munda","Polished Lady Beetle",Iowa,Lucas,2023-06-03,08:22:39,"Red Haw State Park",41.00160779,-93.27816916166667,"Mark Brown",adult,Sighting,Photograph,1,,,,,,,,,
343104,,,,"Cicindela sexguttata","Six-spotted Tiger Beetle",Iowa,Lucas,2023-06-03,10:36:16,"Stephens State Forest - Thousand Acre Unit, Lucas County",41.098114153333,-93.107508186667,"Mark Brown",adult,Sighting,Photograph,1,,,,,,,,,
344522,,,,"Cicindela sexguttata","Six-spotted Tiger Beetle",Iowa,Lucas,2023-05-13,,"Stephens State Forest- Mine Pond",41.016084,-93.479874,"Jay Gilliam",adult,Sighting,Photograph,1,,,,,,,,,
