ID,"Collection / Source","Catalog Number","Specify Number",Taxon,"Common Name",State,County,Date,Time,Locale,Latitude,Longitude,Collector,"Life Stage","Collection Method","Preparation Type",Count,Temperature,Humidity,"Dew Point",Wind,"Wind Direction","Barometric Pressure",Sky,"Moon Phase",Notes
3029,,2014-003310,,"Erynnis juvenalis","Juvenal's Duskywing",Iowa,Lucas,1950-05-01,,"Lucas County",40.991203,-93.33889," USGS - NPWRC",adult,Sighting,Sighting,1,,,,,,,,,"HIstorical Record"
6821,,2014-007102,,"Erynnis juvenalis","Juvenal's Duskywing",Iowa,Lucas,2009-05-03,,"Stephens State Forest - Thousand Acre Unit, Lucas County",41.103003,-93.101751,"Aaron Brees",adult,Sighting,Photograph,5,,,,,,,,,
6822,,2014-007103,,"Erynnis juvenalis","Juvenal's Duskywing",Iowa,Lucas,2009-05-03,,"Stephens State Forest - Woodburn Unit",40.96446,-93.579119,"Aaron Brees",adult,Sighting,Sighting,5,,,,,,,,,
6823,,2014-007104,,"Erynnis juvenalis","Juvenal's Duskywing",Iowa,Lucas,2009-05-20,,"Stephens State Forest - Woodburn Unit",40.96446,-93.579119,"Aaron Brees",adult,Sighting,Sighting,1,,,,,,,,,
275092,,,,"Erynnis juvenalis","Juvenal's Duskywing",Iowa,Lucas,2020-04-30,,"Stephens State Forest - Thousand Acre Unit, Lucas County",41.103003,-93.101751,"Jay Gilliam",adult,Sighting,Photograph,1,,,,,,,,,
287454,,,,"Erynnis juvenalis","Juvenal's Duskywing",Iowa,Lucas,2021-04-17,,"Stephens State Forest - Thousand Acre Unit, Lucas County",41.104584,-93.101778,"Jay Gilliam",adult,Sighting,Photograph,1,,,,,,,,,
300370,,,,"Erynnis juvenalis","Juvenal's Duskywing",Iowa,Lucas,2021-04-24,,"Stephens State Forest- Mine Pond",41.016084,-93.479874,"Jay Gilliam",adult,Sighting,Sighting,6,,,,,,,,,
317753,,,,"Erynnis juvenalis","Juvenal's Duskywing",Iowa,Lucas,2022-05-07,,"Stephens State Forest- Mine Pond",41.016084,-93.479874,"Jay Gilliam",adult,Sighting,Photograph,3,,,,,,,,,
