ID,"Collection / Source","Catalog Number","Specify Number",Taxon,"Common Name",State,County,Date,Time,Locale,Latitude,Longitude,Collector,"Life Stage","Collection Method","Preparation Type",Count,Temperature,Humidity,"Dew Point",Wind,"Wind Direction","Barometric Pressure",Sky,"Moon Phase",Notes
5162,,2014-005443,,"Polites coras","Peck's Skipper",Iowa,Madison,1950-07-30,,"Madison County",41.292236,-93.987846," USGS - NPWRC",adult,Sighting,Sighting,1,,,,,,,,,"HIstorical Record"
5239,,2014-005520,,"Polites themistocles","Tawny-edged Skipper",Iowa,Madison,1950-08-01,,"Madison County",41.292236,-93.987846," USGS - NPWRC",adult,Sighting,Sighting,1,,,,,,,,,"HIstorical Record"
6415,,2014-006696,,"Polites egeremet","Northern Broken-Dash",Iowa,Madison,1950-07-15,,"Madison County",41.292236,-93.987846," USGS - NPWRC",adult,Sighting,Sighting,1,,,,,,,,,"HIstorical Record"
246745,,,,"Polites coras","Peck's Skipper",Iowa,Madison,2009-06-13,,"Madison County",41.29224,-93.98785,"Chris Edwards",,Sighting,Sighting,3,,,,,,,,,
275302,,,,"Polites coras","Peck's Skipper",Iowa,Madison,2020-06-05,,"Jensen Marsh",41.328274,-93.793668,"Jay Gilliam",adult,Sighting,Photograph,5,,,,,,,,,
275639,,,,"Polites themistocles","Tawny-edged Skipper",Iowa,Madison,2019-09-26,,"Jensen Marsh",41.328274,-93.793668,"Jay Gilliam",adult,Sighting,Sighting,1,,,,,,,,,
317875,,,,"Polites themistocles","Tawny-edged Skipper",Iowa,Madison,2022-06-04,,"Middle River Park",41.317638,-94.004713,"Jay Gilliam",adult,Sighting,Photograph,2,,,,,,,,,
347038,,,,"Polites themistocles","Tawny-edged Skipper",Iowa,Madison,2023-08-19,,"Pammel State Park",41.294986,-94.074903,"Jay Gilliam",adult,Sighting,Sighting,3,,,,,,,,,
