ID,"Collection / Source","Catalog Number","Specify Number",Taxon,"Common Name",State,County,Date,Time,Locale,Latitude,Longitude,Collector,"Life Stage","Collection Method","Preparation Type",Count,Temperature,Humidity,"Dew Point",Wind,"Wind Direction","Barometric Pressure",Sky,"Moon Phase",Notes
4917,,2014-005198,,"Pieris rapae","Cabbage White",Iowa,Madison,1950-07-20,,"Madison County",41.292236,-93.987846," USGS - NPWRC",adult,Sighting,Sighting,1,,,,,,,,,"HIstorical Record"
203052,,2018-000859,,"Pieris rapae","Cabbage White",Iowa,Madison,2017-04-10,,"Guye Woods County Park",41.415413,-93.958168,"Chris Edwards",adult,Sighting,Sighting,1,,,,,,,,,
275133,,,,"Pieris rapae","Cabbage White",Iowa,Madison,2020-06-05,,"Jensen Marsh",41.328274,-93.793668,"Jay Gilliam",adult,Sighting,Sighting,1,,,,,,,,,
275319,,,,"Pieris rapae","Cabbage White",Iowa,Madison,2020-05-25,,"Jensen Marsh",41.328274,-93.793668,"Jay Gilliam",adult,Sighting,Sighting,7,,,,,,,,,
275491,,,,"Pieris rapae","Cabbage White",Iowa,Madison,2019-08-15,,"Jensen Marsh",41.328274,-93.793668,"Jay Gilliam",adult,Sighting,Photograph,1,,,,,,,,,
275625,,,,"Pieris rapae","Cabbage White",Iowa,Madison,2019-09-26,,"Jensen Marsh",41.328274,-93.793668,"Jay Gilliam",adult,Sighting,Sighting,1,,,,,,,,,
275928,,,,"Pieris rapae","Cabbage White",Iowa,Madison,2020-07-03,,"Pammel State Park",41.294986,-94.074903,"Jay Gilliam",adult,Sighting,Sighting,1,,,,,,,,,
276156,,,,"Pieris rapae","Cabbage White",Iowa,Madison,2020-08-03,,"Pammel State Park",41.294986,-94.074903,"Jay Gilliam",adult,Sighting,Sighting,1,,,,,,,,,
276273,,,,"Pieris rapae","Cabbage White",Iowa,Madison,2020-10-02,,"Pammel State Park",41.294986,-94.074903,"Jay Gilliam",adult,Sighting,Sighting,1,,,,,,,,,
296681,,,,"Pieris rapae","Cabbage White",Iowa,Madison,2021-08-15,9:07:40,"Middle River Park",41.3175083,-94.00387136,"Mark Brown",adult,Sighting,Photograph,1,,,,,,,,,
300727,,,,"Pieris rapae","Cabbage White",Iowa,Madison,2021-07-10,,"Pammel State Park",41.294986,-94.074903,"Jay Gilliam",adult,Sighting,Sighting,1,,,,,,,,,
300905,,,,"Pieris rapae","Cabbage White",Iowa,Madison,2021-08-08,,"Middle River Park",41.317638,-94.004713,"Jay Gilliam",adult,Sighting,Sighting,1,,,,,,,,,
300913,,,,"Pieris rapae","Cabbage White",Iowa,Madison,2021-08-08,,"Pammel State Park",41.294986,-94.074903,"Jay Gilliam",adult,Sighting,Sighting,8,,,,,,,,,
301013,,,,"Pieris rapae","Cabbage White",Iowa,Madison,2021-08-22,,"Middle River Park",41.317638,-94.004713,"Jay Gilliam",adult,Sighting,Sighting,1,,,,,,,,,
301097,,,,"Pieris rapae","Cabbage White",Iowa,Madison,2021-09-18,,"Pammel State Park",41.294986,-94.074903,"Jay Gilliam",adult,Sighting,Sighting,1,,,,,,,,,
301124,,,,"Pieris rapae","Cabbage White",Iowa,Madison,2021-09-25,,"Jensen Marsh",41.328274,-93.793668,"Jay Gilliam",adult,Sighting,Sighting,1,,,,,,,,,
301130,,,,"Pieris rapae","Cabbage White",Iowa,Madison,2021-09-25,,"Pammel State Park",41.294986,-94.074903,"Jay Gilliam",adult,Sighting,Sighting,1,,,,,,,,,
317721,,,,"Pieris rapae","Cabbage White",Iowa,Madison,2022-04-24,,"Pammel State Park",41.294986,-94.074903,"Jay Gilliam",adult,Sighting,Photograph,2,,,,,,,,,
317876,,,,"Pieris rapae","Cabbage White",Iowa,Madison,2022-06-04,,"Middle River Park",41.317638,-94.004713,"Jay Gilliam",adult,Sighting,Sighting,1,,,,,,,,,
318046,,,,"Pieris rapae","Cabbage White",Iowa,Madison,2022-06-26,,"Middle River Park",41.317638,-94.004713,"Jay Gilliam",adult,Sighting,Sighting,2,,,,,,,,,
318051,,,,"Pieris rapae","Cabbage White",Iowa,Madison,2022-06-26,,"Pammel State Park",41.294986,-94.074903,"Jay Gilliam",adult,Sighting,Sighting,5,,,,,,,,,
347024,,,,"Pieris rapae","Cabbage White",Iowa,Madison,2023-08-19,,"Middle River Park",41.317638,-94.004713,"Jay Gilliam",adult,Sighting,Sighting,8,,,,,,,,,
347033,,,,"Pieris rapae","Cabbage White",Iowa,Madison,2023-08-19,,"Pammel State Park",41.294986,-94.074903,"Jay Gilliam",adult,Sighting,Sighting,3,,,,,,,,,
