ID,"Collection / Source","Catalog Number","Specify Number",Taxon,"Common Name",State,County,Date,Time,Locale,Latitude,Longitude,Collector,"Life Stage","Collection Method","Preparation Type",Count,Temperature,Humidity,"Dew Point",Wind,"Wind Direction","Barometric Pressure",Sky,"Moon Phase",Notes
6315,,2014-006596,,"Vanessa cardui","Painted Lady",Iowa,Marion,1950-09-10,,"Marion County",41.317383,-93.177963," USGS - NPWRC",adult,Sighting,Sighting,1,,,,,,,,,"HIstorical Record"
64127,,2014-064728,,"Vanessa cardui","Painted Lady",Iowa,Marion,2005-06-21,,"Pleasantville Mitigation",41.2651,-93.2397,"Dennis Schlicht",adult,Sighting,Sighting,1,,,,,,,,,
64128,,2014-064729,,"Vanessa cardui","Painted Lady",Iowa,Marion,2005-07-13,,"Pleasantville Mitigation",41.2651,-93.2397,"Dennis Schlicht",adult,Sighting,Sighting,1,,,,,,,,,
64129,,2014-064730,,"Vanessa cardui","Painted Lady",Iowa,Marion,2005-08-10,,"Pleasantville Mitigation",41.2651,-93.2397,"Frank Olsen",adult,Sighting,Sighting,2,,,,,,,,,
64130,,2014-064731,,"Vanessa cardui","Painted Lady",Iowa,Marion,2005-08-29,,"Pleasantville Mitigation",41.2651,-93.2397,"Frank Olsen",adult,Sighting,Sighting,2,,,,,,,,,
64131,,2014-064732,,"Vanessa cardui","Painted Lady",Iowa,Marion,2005-08-19,,"Pleasantville Mitigation",41.2651,-93.2397,"Frank Olsen",adult,Sighting,Sighting,5,,,,,,,,,
64132,,2014-064733,,"Vanessa cardui","Painted Lady",Iowa,Marion,2005-06-02,,"Pleasantville Mitigation",41.2651,-93.2397,"Frank Olsen",adult,Sighting,Sighting,1,,,,,,,,,
119922,,2015-010480,,"Vanessa cardui","Painted Lady",Iowa,Marion,2005-08-14,,"Pinchey Bottoms",41.459174,-93.272169,"Chris Edwards",adult,Sighting,Sighting,20,,,,,,,,,
263178,,,,"Vanessa cardui","Painted Lady",Iowa,Marion,2019-06-20,13:10,"Central College Field Station",41.368123,-93.01636,IBSN,adult,Sighting,Sighting,3,73,,,"Relatively Still",,,"Partly Cloudy",,
263179,,,,"Vanessa cardui","Painted Lady",Iowa,Marion,2019-06-26,11:50,"Central College Field Station",41.368123,-93.01636,IBSN,adult,Sighting,Sighting,2,81,,,Calm,,,Clear,,
263180,,,,"Vanessa cardui","Painted Lady",Iowa,Marion,2019-07-01,10:30,"Central College Field Station",41.368123,-93.01636,IBSN,adult,Sighting,Sighting,3,83,,,"Relatively Still",,,"Mostly Clear",,
263181,,,,"Vanessa cardui","Painted Lady",Iowa,Marion,2019-08-08,11:07,"Central College Field Station",41.368123,-93.01636,IBSN,adult,Sighting,Sighting,23,75,,,"Moderately Windy",,,"Mostly Cloudy",,
263182,,,,"Vanessa cardui","Painted Lady",Iowa,Marion,2019-08-01,11:00,"Central College Field Station",41.368123,-93.01636,IBSN,adult,Sighting,Sighting,42,76,,,"Moderately Windy",,,Clear,,
275278,,,,"Vanessa cardui","Painted Lady",Iowa,Marion,2020-05-29,,"Wilcox Wildlife Area",41.238081,-92.956863,"Jay Gilliam",adult,Sighting,Sighting,4,,,,,,,,,
275298,,,,"Vanessa cardui","Painted Lady",Iowa,Marion,2020-05-29,,"Pella State Game Management Area",41.373606,-92.901042,"Jay Gilliam",adult,Sighting,Sighting,5,,,,,,,,,
286628,,,,"Vanessa cardui","Painted Lady",Iowa,Marion,2020-06-24,,"Central College Field Station",41.368123,-93.01636,IBSN,adult,Sighting,Sighting,1,78,,,"Relatively Still",,,"Partly Cloudy",,
286636,,,,"Vanessa cardui","Painted Lady",Iowa,Marion,2020-06-30,,"Central College Field Station",41.368123,-93.01636,IBSN,adult,Sighting,Sighting,1,80,,,"Moderately Windy",,,"Partly Cloudy",,
286653,,,,"Vanessa cardui","Painted Lady",Iowa,Marion,2020-07-21,,"Central College Field Station",41.368123,-93.01636,IBSN,adult,Sighting,Sighting,1,74,,,Calm,,,Overcast,,
286669,,,,"Vanessa cardui","Painted Lady",Iowa,Marion,2020-07-29,,"Central College Field Station",41.368123,-93.01636,IBSN,adult,Sighting,Sighting,2,86,,,Calm,,,"Mostly Clear",,
286685,,,,"Vanessa cardui","Painted Lady",Iowa,Marion,2020-08-04,,"Central College Field Station",41.368123,-93.01636,IBSN,adult,Sighting,Sighting,1,74,,,"Relatively Still",,,"Mostly Clear",,
286693,,,,"Vanessa cardui","Painted Lady",Iowa,Marion,2020-08-10,,"Central College Field Station",41.368123,-93.01636,IBSN,adult,Sighting,Sighting,1,82,,,"Moderately Windy",,,"Partly Cloudy",,
286715,,,,"Vanessa cardui","Painted Lady",Iowa,Marion,2020-08-23,,"Central College Field Station",41.368123,-93.01636,IBSN,adult,Sighting,Sighting,1,80,,,"Relatively Still",,,Clear,,
318492,,,,"Vanessa cardui","Painted Lady",Iowa,Marion,2022-08-28,,"Elk Rock State Park",41.39775,-93.090603,"Jay Gilliam",adult,Sighting,Sighting,1,,,,,,,,,
318669,,,,"Vanessa cardui","Painted Lady",Iowa,Marion,2022-10-01,,"Roberts Creek Park",41.42076,-93.052121,"Jay Gilliam",adult,Sighting,Sighting,2,,,,,,,,,
318673,,,,"Vanessa cardui","Painted Lady",Iowa,Marion,2022-10-01,,"Cordova Park",41.42552,-93.089529,"Jay Gilliam",adult,Sighting,Sighting,1,,,,,,,,,
318688,,,,"Vanessa cardui","Painted Lady",Iowa,Marion,2022-10-01,,"Elk Rock State Park",41.39775,-93.090603,"Jay Gilliam",adult,Sighting,Photograph,6,,,,,,,,,
318706,,,,"Vanessa cardui","Painted Lady",Iowa,Marion,2022-10-08,,"Red Rock Reservoir- Elk Rock Archery Range",41.407931,-93.108048,"Jay Gilliam",adult,Sighting,Photograph,2,,,,,,,,,
318710,,,,"Vanessa cardui","Painted Lady",Iowa,Marion,2022-10-08,,"Roberts Creek Park",41.42076,-93.052121,"Jay Gilliam",adult,Sighting,Sighting,2,,,,,,,,,
318720,,,,"Vanessa cardui","Painted Lady",Iowa,Marion,2022-10-08,,"Elk Rock State Park",41.40032,-93.060454,"Jay Gilliam",adult,Sighting,Sighting,1,,,,,,,,,
318728,,,,"Vanessa cardui","Painted Lady",Iowa,Marion,2022-10-16,,"Red Rock Reservoir- Elk Rock Archery Range",41.407931,-93.108048,"Jay Gilliam",adult,Sighting,Sighting,2,,,,,,,,,
318730,,,,"Vanessa cardui","Painted Lady",Iowa,Marion,2022-10-16,,"Roberts Creek Park",41.42076,-93.052121,"Jay Gilliam",adult,Sighting,Sighting,3,,,,,,,,,
346273,,,,"Vanessa cardui","Painted Lady",Iowa,Marion,2023-09-23,,"Elk Rock State Park",41.40032,-93.060454,"Jay Gilliam",adult,Sighting,Photograph,3,,,,,,,,,6018
347120,,,,"Vanessa cardui","Painted Lady",Iowa,Marion,2023-09-23,,"Roberts Creek Park",41.42076,-93.052121,"Jay Gilliam",adult,Sighting,Sighting,1,,,,,,,,,
347160,,,,"Vanessa cardui","Painted Lady",Iowa,Marion,2023-09-30,,"Elk Rock State Park",41.40032,-93.060454,"Jay Gilliam",adult,Sighting,Sighting,3,,,,,,,,,
366144,,,,"Vanessa cardui","Painted Lady",Iowa,Marion,2023-07-03,,"Central College Field Station",41.368123,-93.01636,IBSN,adult,Sighting,Sighting,1,,,,"Moderately Windy",,,"Mostly Clear",,
