ID,"Collection / Source","Catalog Number","Specify Number",Taxon,"Common Name",State,County,Date,Time,Locale,Latitude,Longitude,Collector,"Life Stage","Collection Method","Preparation Type",Count,Temperature,Humidity,"Dew Point",Wind,"Wind Direction","Barometric Pressure",Sky,"Moon Phase",Notes
1706,,2014-001987,,"Anatrytone logan","Delaware Skipper",Iowa,Marshall,1950-07-01,,"Marshall County",42.04071,-92.937576," USGS - NPWRC",adult,Sighting,Sighting,1,,,,,,,,,"HIstorical Record"
1778,,2014-002059,,"Ancyloxypha numitor","Least Skipper",Iowa,Marshall,1950-08-01,,"Marshall County",42.04071,-92.937576," USGS - NPWRC",adult,Sighting,Sighting,1,,,,,,,,,"HIstorical Record"
1867,,2014-002148,,"Asterocampa celtis","Hackberry Emperor",Iowa,Marshall,1950-06-15,,"Marshall County",42.04071,-92.937576," USGS - NPWRC",adult,Sighting,Sighting,1,,,,,,,,,"HIstorical Record"
1916,,2014-002197,,"Asterocampa clyton","Tawny Emperor",Iowa,Marshall,1950-06-30,,"Marshall County",42.04071,-92.937576," USGS - NPWRC",adult,Sighting,Sighting,1,,,,,,,,,"HIstorical Record"
2068,,2014-002349,,"Boloria bellona","Meadow Fritillary",Iowa,Marshall,1950-08-01,,"Marshall County",42.04071,-92.937576," USGS - NPWRC",adult,Sighting,Sighting,1,,,,,,,,,"HIstorical Record"
2216,,2014-002497,,"Celastrina neglecta","Summer Azure",Iowa,Marshall,1950-06-15,,"Marshall County",42.04071,-92.937576," USGS - NPWRC",adult,Sighting,Sighting,1,,,,,,,,,"HIstorical Record"
2303,,2014-002583,,"Cercyonis pegala","Common Wood-nymph",Iowa,Marshall,1950-07-15,,"Marshall County",42.04071,-92.937576," USGS - NPWRC",adult,Sighting,Sighting,1,,,,,,,,,"HIstorical Record"
2368,,2014-002649,,"Chlosyne gorgone","Gorgone Checkerspot",Iowa,Marshall,1950-07-01,,"Marshall County",42.04071,-92.937576," USGS - NPWRC",adult,Sighting,Sighting,1,,,,,,,,,"HIstorical Record"
2514,,2014-002795,,"Colias eurytheme","Orange Sulphur",Iowa,Marshall,1950-08-01,,"Marshall County",42.04071,-92.937576," USGS - NPWRC",adult,Sighting,Sighting,1,,,,,,,,,"HIstorical Record"
2610,,2014-002891,,"Colias philodice","Clouded Sulphur",Iowa,Marshall,1950-08-01,,"Marshall County",42.04071,-92.937576," USGS - NPWRC",adult,Sighting,Sighting,1,,,,,,,,,"HIstorical Record"
2714,,2014-002995,,"Danaus plexippus",Monarch,Iowa,Marshall,1950-09-10,,"Marshall County",42.04071,-92.937576," USGS - NPWRC",adult,Sighting,Sighting,1,,,,,,,,,"HIstorical Record"
2815,,2014-003096,,"Echinargus isola","Reakirt's Blue",Iowa,Marshall,1950-07-15,,"Marshall County",42.04071,-92.937576," USGS - NPWRC",adult,Sighting,Sighting,1,,,,,,,,,"HIstorical Record"
2911,,2014-003192,,"Epargyreus clarus","Silver-spotted Skipper",Iowa,Marshall,1950-08-01,,"Marshall County",42.04071,-92.937576," USGS - NPWRC",adult,Sighting,Sighting,1,,,,,,,,,"HIstorical Record"
3158,,2014-003439,,"Euphyes conspicua","Black Dash",Iowa,Marshall,1950-07-15,,"Marshall County",42.04071,-92.937576," USGS - NPWRC",adult,Sighting,Sighting,1,,,,,,,,,"HIstorical Record"
3184,,2014-003465,,"Euphyes dion","Dion Skipper",Iowa,Marshall,1950-07-15,,Redacted,Redacted,Redacted," USGS - NPWRC",adult,Sighting,Sighting,1,,,,,,,,,"HIstorical Record"
3223,,2014-003504,,"Euphyes vestris","Dun Skipper",Iowa,Marshall,1950-08-01,,"Marshall County",42.04071,-92.937576," USGS - NPWRC",adult,Sighting,Sighting,1,,,,,,,,,"HIstorical Record"
3318,,2014-003599,,"Pyrisitia lisa","Little Yellow",Iowa,Marshall,1950-09-01,,"Marshall County",42.04071,-92.937576," USGS - NPWRC",adult,Sighting,Sighting,1,,,,,,,,,"HIstorical Record"
3367,,2014-003648,,"Eurytides marcellus","Zebra Swallowtail",Iowa,Marshall,1950-07-01,,"Marshall County",42.04071,-92.937576," USGS - NPWRC",adult,Sighting,Sighting,1,,,,,,,,,"HIstorical Record"
3432,,2014-003713,,"Cupido comyntas","Eastern-tailed Blue",Iowa,Marshall,1950-08-01,,"Marshall County",42.04071,-92.937576," USGS - NPWRC",adult,Sighting,Sighting,1,,,,,,,,,"HIstorical Record"
3563,,2014-003844,,"Hyalophora cecropia","Cecropia Moth",Iowa,Marshall,1950-06-20,,"Marshall County",42.04071,-92.937576," USGS - NPWRC",adult,,Sighting,1,,,,,,,,,"HIstorical Record"
3669,,2014-003950,,"Junonia coenia","Common Buckeye",Iowa,Marshall,1950-08-01,,"Marshall County",42.04071,-92.937576," USGS - NPWRC",adult,Sighting,Sighting,1,,,,,,,,,"HIstorical Record"
3729,,2014-004010,,"Libytheana carinenta","American Snout",Iowa,Marshall,1950-07-15,,"Marshall County",42.04071,-92.937576," USGS - NPWRC",adult,Sighting,Sighting,1,,,,,,,,,"HIstorical Record"
3784,,2014-004065,,"Limenitis archippus",Viceroy,Iowa,Marshall,1950-08-01,,"Marshall County",42.04071,-92.937576," USGS - NPWRC",adult,Sighting,Sighting,1,,,,,,,,,"HIstorical Record"
3929,,2014-004210,,"Limenitis arthemis astyanax","Red-spotted Purple",Iowa,Marshall,2012-06-09,,"Marshall County",42.0153573,-93.05363," BAMONA",adult,Sighting,Sighting,1,,,,,,,,,
4015,,2014-004296,,"Tharsalea dione","Gray Copper",Iowa,Marshall,1950-07-01,,"Marshall County",42.04071,-92.937576," USGS - NPWRC",adult,Sighting,Sighting,1,,,,,,,,,"HIstorical Record"
4146,,2014-004427,,"Lycaena hypophlaeas","American Copper",Iowa,Marshall,1950-07-01,,"Marshall County",42.04071,-92.937576," USGS - NPWRC",adult,Sighting,Sighting,1,,,,,,,,,"HIstorical Record"
4219,,2014-004500,,"Megisto cymela","Little Wood Satyr",Iowa,Marshall,1950-06-15,,"Marshall County",42.04071,-92.937576," USGS - NPWRC",adult,Sighting,Sighting,1,,,,,,,,,"HIstorical Record"
4330,,2014-004611,,"Nymphalis antiopa","Mourning Cloak",Iowa,Marshall,1950-07-01,,"Marshall County",42.04071,-92.937576," USGS - NPWRC",adult,Sighting,Sighting,1,,,,,,,,,"HIstorical Record"
4440,,2014-004721,,"Heraclides cresphontes","Giant Swallowtail",Iowa,Marshall,1950-06-01,,"Marshall County",42.04071,-92.937576," USGS - NPWRC",adult,Sighting,Sighting,1,,,,,,,,,"HIstorical Record"
4513,,2014-004794,,"Pterourus glaucus","Eastern Tiger Swallowtail",Iowa,Marshall,1950-08-01,,"Marshall County",42.04071,-92.937576," USGS - NPWRC",adult,Sighting,Sighting,1,,,,,,,,,"HIstorical Record"
4599,,2014-004880,,"Papilio polyxenes","Black Swallowtail",Iowa,Marshall,1950-08-01,,"Marshall County",42.04071,-92.937576," USGS - NPWRC",adult,Sighting,Sighting,1,,,,,,,,,"HIstorical Record"
4723,,2014-005004,,"Pholisora catullus","Common Sootywing",Iowa,Marshall,1950-08-01,,"Marshall County",42.04071,-92.937576," USGS - NPWRC",adult,Sighting,Sighting,1,,,,,,,,,"HIstorical Record"
4825,,2014-005106,,"Phyciodes tharos","Pearl Crescent",Iowa,Marshall,1950-07-01,,"Marshall County",42.04071,-92.937576," USGS - NPWRC",adult,Sighting,Sighting,1,,,,,,,,,"HIstorical Record"
4920,,2014-005201,,"Pieris rapae","Cabbage White",Iowa,Marshall,1950-07-20,,"Marshall County",42.04071,-92.937576," USGS - NPWRC",adult,Sighting,Sighting,1,,,,,,,,,"HIstorical Record"
4989,,2014-005270,,"Lon hobomok","Hobomok Skipper",Iowa,Marshall,1950-06-01,,"Marshall County",42.04071,-92.937576," USGS - NPWRC",adult,Sighting,Sighting,1,,,,,,,,,"HIstorical Record"
5111,,2014-005392,,"Polites origenes","Cross-line Skipper",Iowa,Marshall,1950-07-01,,"Marshall County",42.04071,-92.937576," USGS - NPWRC",adult,Sighting,Sighting,1,,,,,,,,,"HIstorical Record"
5163,,2014-005444,,"Polites coras","Peck's Skipper",Iowa,Marshall,1950-07-30,,"Marshall County",42.04071,-92.937576," USGS - NPWRC",adult,Sighting,Sighting,1,,,,,,,,,"HIstorical Record"
5242,,2014-005523,,"Polites themistocles","Tawny-edged Skipper",Iowa,Marshall,1950-08-01,,"Marshall County",42.04071,-92.937576," USGS - NPWRC",adult,Sighting,Sighting,1,,,,,,,,,"HIstorical Record"
5301,,2014-005582,,"Polygonia comma","Eastern Comma",Iowa,Marshall,1950-07-01,,"Marshall County",42.04071,-92.937576," USGS - NPWRC",adult,Sighting,Sighting,1,,,,,,,,,"HIstorical Record"
5370,,2014-005651,,"Polygonia interrogationis","Question Mark",Iowa,Marshall,1950-06-30,,"Marshall County",42.04071,-92.937576," USGS - NPWRC",adult,Sighting,Sighting,1,,,,,,,,,"HIstorical Record"
5492,,2014-005773,,"Pontia protodice","Checkered White",Iowa,Marshall,1950-08-01,,"Marshall County",42.04071,-92.937576," USGS - NPWRC",adult,Sighting,Sighting,1,,,,,,,,,"HIstorical Record"
5661,,2014-005942,,"Satyrium calanus","Banded Hairstreak",Iowa,Marshall,1950-07-01,,"Marshall County",42.04071,-92.937576," USGS - NPWRC",adult,Sighting,Sighting,1,,,,,,,,,"HIstorical Record"
5814,,2014-006095,,"Lethe eurydice","Eyed Brown",Iowa,Marshall,1950-07-15,,"Marshall County",42.04071,-92.937576," USGS - NPWRC",adult,Sighting,Sighting,1,,,,,,,,,"HIstorical Record"
5940,,2014-006221,,"Argynnis cybele","Great Spangled Fritillary",Iowa,Marshall,1950-07-01,,"Marshall County",42.04071,-92.937576," USGS - NPWRC",adult,Sighting,Sighting,1,,,,,,,,,"HIstorical Record"
6049,,2014-006330,,"Staphylus hayhurstii","Hayhurst's Scallopwing",Iowa,Marshall,1950-06-01,,"Marshall County",42.04071,-92.937576," USGS - NPWRC",adult,Sighting,Sighting,1,,,,,,,,,"HIstorical Record"
6115,,2014-006396,,"Thorybes bathyllus","Southern Cloudwing",Iowa,Marshall,1950-06-20,,"Marshall County",42.04071,-92.937576," USGS - NPWRC",adult,Sighting,Sighting,1,,,,,,,,,"HIstorical Record"
6242,,2014-006523,,"Vanessa atalanta","Red Admiral",Iowa,Marshall,1950-06-15,,"Marshall County",42.04071,-92.937576," USGS - NPWRC",adult,Sighting,Sighting,1,,,,,,,,,"HIstorical Record"
6841,,2014-007122,,"Euphyes dion","Dion Skipper",Iowa,Marshall,2014-06-28,,Redacted,Redacted,Redacted,"Aaron Brees",adult,Sighting,Sighting,1,,,,,,,,,
7821,,2014-008102,,"Boloria bellona","Meadow Fritillary",Iowa,Marshall,2010-10-09,,"Marietta Sand Prairie State Preserve",42.0961111,-93.0341667,"Tom Jantscher",adult,Sighting,Sighting,1,,,,,,,,,
8148,,2014-008429,,"Colias eurytheme","Orange Sulphur",Iowa,Marshall,2010-10-09,,"Marietta Sand Prairie State Preserve",42.1016667,-93.035,"Tom Jantscher",adult,Sighting,Sighting,10,,,,,,,,,
8149,,2014-008430,,"Colias philodice","Clouded Sulphur",Iowa,Marshall,2010-05-23,,"Marietta Sand Prairie State Preserve",42.1016667,-93.035,"Tom Jantscher",adult,Sighting,Sighting,1,,,,,,,,,
8150,,2014-008431,,"Colias philodice","Clouded Sulphur",Iowa,Marshall,2010-10-09,,"Marietta Sand Prairie State Preserve",42.1016667,-93.035,"Tom Jantscher",adult,Sighting,Sighting,15,,,,,,,,,
8283,,2014-008564,,"Danaus plexippus",Monarch,Iowa,Marshall,2010-05-23,,"Marietta Sand Prairie State Preserve",42.1016667,-93.035,"Tom Jantscher",adult,Sighting,Sighting,1,,,,,,,,,
8284,,2014-008565,,"Danaus plexippus",Monarch,Iowa,Marshall,2010-10-09,,"Marietta Sand Prairie State Preserve",42.1016667,-93.035,"Tom Jantscher",adult,Sighting,Sighting,1,,,,,,,,,
8516,,2014-008797,,"Pyrisitia lisa","Little Yellow",Iowa,Marshall,2010-10-09,,"Marietta Sand Prairie State Preserve",42.1016667,-93.035,"Tom Jantscher",adult,Sighting,Sighting,2,,,,,,,,,
8659,,2014-008940,,"Cupido comyntas","Eastern-tailed Blue",Iowa,Marshall,2010-05-23,,"Marietta Sand Prairie State Preserve",42.1016667,-93.035,"Tom Jantscher",adult,Sighting,Sighting,1,,,,,,,,,
8660,,2014-008941,,"Cupido comyntas","Eastern-tailed Blue",Iowa,Marshall,2010-10-09,,"Marietta Sand Prairie State Preserve",42.0958333,-93.0308333,"Tom Jantscher",adult,Sighting,Sighting,1,,,,,,,,,
8741,,2014-009022,,"Hylephila phyleus","Fiery Skipper",Iowa,Marshall,2010-10-09,,"Marietta Sand Prairie State Preserve",42.0969444,-93.0297222,"Tom Jantscher",adult,Sighting,Sighting,5,,,,,,,,,
8845,,2014-009126,,"Junonia coenia","Common Buckeye",Iowa,Marshall,2010-10-09,,"Marietta Sand Prairie State Preserve",42.0958333,-93.0308333,"Tom Jantscher",adult,Sighting,Sighting,3,,,,,,,,,
8984,,2014-009265,,"Limenitis archippus",Viceroy,Iowa,Marshall,2010-10-09,,"Marietta Sand Prairie State Preserve",42.1036111,-93.0383333,"Tom Jantscher",adult,Sighting,Sighting,1,,,,,,,,,
9042,,2014-009323,,"Lycaena hypophlaeas","American Copper",Iowa,Marshall,2010-10-09,,"Marietta Sand Prairie State Preserve",42.1016667,-93.035,"Tom Jantscher",adult,Sighting,Sighting,12,,,,,,,,,
9108,,2014-009389,,"Nathalis iole","Dainty Sulphur",Iowa,Marshall,2010-10-09,,"Marietta Sand Prairie State Preserve",42.1036111,-93.0383333,"Tom Jantscher",adult,Sighting,Sighting,3,,,,,,,,,
9505,,2014-009786,,"Phyciodes tharos","Pearl Crescent",Iowa,Marshall,2010-05-23,,"Marietta Sand Prairie State Preserve",42.1016667,-93.035,"Tom Jantscher",adult,Sighting,Sighting,5,,,,,,,,,
9506,,2014-009787,,"Phyciodes tharos","Pearl Crescent",Iowa,Marshall,2010-10-09,,"Marietta Sand Prairie State Preserve",42.0958333,-93.0308333,"Tom Jantscher",adult,Sighting,Sighting,50,,,,,,,,,
9643,,2014-009924,,"Pieris rapae","Cabbage White",Iowa,Marshall,2010-10-09,,"Marietta Sand Prairie State Preserve",42.0958333,-93.0308333,"Tom Jantscher",adult,Sighting,Sighting,2,,,,,,,,,
9776,,2014-010057,,"Polites coras","Peck's Skipper",Iowa,Marshall,2010-05-23,,"Marietta Sand Prairie State Preserve",42.1016667,-93.035,"Tom Jantscher",adult,Sighting,Sighting,1,,,,,,,,,
9777,,2014-010058,,"Polites coras","Peck's Skipper",Iowa,Marshall,2010-10-09,,"Marietta Sand Prairie State Preserve",42.0958333,-93.0308333,"Tom Jantscher",adult,Sighting,Sighting,1,,,,,,,,,
9890,,2014-010171,,"Polygonia interrogationis","Question Mark",Iowa,Marshall,2010-10-09,,"Marietta Sand Prairie State Preserve",42.0969444,-93.0297222,"Tom Jantscher",adult,Sighting,Sighting,1,,,,,,,,,
9958,,2014-010239,,"Burnsius communis","Common Checkered Skipper",Iowa,Marshall,2010-10-09,,"Marietta Sand Prairie State Preserve",42.0958333,-93.0308333,"Tom Jantscher",adult,Sighting,Sighting,7,,,,,,,,,
10383,,2014-010664,,"Vanessa atalanta","Red Admiral",Iowa,Marshall,2010-05-23,,"Marietta Sand Prairie State Preserve",42.1016667,-93.035,"Tom Jantscher",adult,Sighting,Sighting,20,,,,,,,,,
10384,,2014-010665,,"Vanessa atalanta","Red Admiral",Iowa,Marshall,2010-10-09,,"Marietta Sand Prairie State Preserve",42.1016667,-93.035,"Tom Jantscher",adult,Sighting,Sighting,4,,,,,,,,,
10385,,2014-010666,,"Vanessa virginiensis","American Lady",Iowa,Marshall,2010-05-23,,"Marietta Sand Prairie State Preserve",42.1016667,-93.035,"Tom Jantscher",adult,Sighting,Sighting,1,,,,,,,,,
11184,,2014-011466,SPM024984,"Lacinipolia meditata","Thinker Moth",Iowa,Marshall,2011-08-31,,"Marietta Sand Prairie State Preserve",42.099164,-93.038965,"Frank Olsen",adult,,Pinned,1,,,,,,,,,"Located at Iowa State"
12658,,2014-012940,SPM036949,"Achyra rantalis","Garden Webworm Moth",Iowa,Marshall,2012-07-30,,Redacted,Redacted,Redacted,"Carl Kurtz",adult,,Photograph,1,,,,,,,,,
13463,,2014-013745,SPM024140,"Acronicta hasta","Speared Dagger Moth",Iowa,Marshall,2011-07-29,,"Marietta Sand Prairie State Preserve",42.09467,-93.03833,"Mike Quinn",adult,,Photograph,1,,,,,,,,,
13724,"Frank Olsen Drawer 30",2014-014006,SPM013355,"Acronicta radcliffei",Radcliffe,Iowa,Marshall,2008-06-19,,"Marietta Sand Prairie State Preserve",42.099164,-93.038965,"Frank Olsen",adult,,Pinned,1,,,,,,,,,"Located at Iowa State"
13882,,2014-014164,SPM036935,"Actias luna","Luna Moth",Iowa,Marshall,2013-08-21,,Redacted,Redacted,Redacted,"Carl Kurtz",adult,,Photograph,1,,,,,,,,,
14600,"Frank Olsen Drawer 30",2014-014887,SPM012808,"Alypia octomaculata","Eight-spotted Forester Moth",Iowa,Marshall,2008-06-19,,"Marietta Sand Prairie State Preserve",42.099164,-93.038965,"Frank Olsen",adult,,Pinned,1,,,,,,,,,"Located at Iowa State"
14822,"Frank Olsen Drawer 54",2014-015114,SPM024351,"Amphion floridensis","Nessus Sphinx Moth",Iowa,Marshall,2011-07-15,,"Marietta Sand Prairie State Preserve",42.099164,-93.038965,"Frank Olsen",adult,,Pinned,1,,,,,,,,,"Located at Iowa State"
15109,"Frank Olsen Drawer 37",2014-015405,SPM024585,"Anagrapha falcifera","Celery Looper Moth",Iowa,Marshall,2011-06-01,,"Marietta Sand Prairie State Preserve",42.099164,-93.038965,"Frank Olsen",adult,,Pinned,1,,,,,,,,,"Located at Iowa State"
15111,"Frank Olsen Drawer 37",2014-015407,SPM024587,"Anagrapha falcifera","Celery Looper Moth",Iowa,Marshall,2011-08-31,,"Marietta Sand Prairie State Preserve",42.099164,-93.038965,"Frank Olsen",adult,,Pinned,1,,,,,,,,,"Located at Iowa State"
15147,,2014-015443,SPM036956,"Anagrapha falcifera","Celery Looper Moth",Iowa,Marshall,2007-05-01,,Redacted,Redacted,Redacted,"Carl Kurtz",adult,,Photograph,1,,,,,,,,,
15291,"Frank Olsen Drawer 19",2014-015587,SPM025151,"Anavitrinella pampinaria","Common Gray",Iowa,Marshall,2011-08-31,,"Marietta Sand Prairie State Preserve",42.099164,-93.038965,"Frank Olsen",adult,,Pinned,1,,,,,,,,,"Located at Iowa State"
15292,"Frank Olsen Drawer 19",2014-015588,SPM025152,"Anavitrinella pampinaria","Common Gray",Iowa,Marshall,2011-08-31,,"Marietta Sand Prairie State Preserve",42.099164,-93.038965,"Frank Olsen",adult,,Pinned,1,,,,,,,,,"Located at Iowa State"
15363,,2014-015659,SPM036953,"Anavitrinella pampinaria","Common Gray",Iowa,Marshall,2007-08-09,,Redacted,Redacted,Redacted,"Carl Kurtz",adult,,Photograph,1,,,,,,,,,
15364,,2014-015660,SPM036968,"Anavitrinella pampinaria","Common Gray",Iowa,Marshall,2006-08-03,,Redacted,Redacted,Redacted,"Carl Kurtz",adult,,Photograph,1,,,,,,,,,
15864,"Jim Durbin Drawer 117",2014-016162,SPM013543,"Hypena scabra","Green Cloverworm Moth",Iowa,Marshall,2007-08-09,,Redacted,Redacted,Redacted,"MJ Hatfield",adult,,Pinned,1,,,,,,,,,
15909,"Frank Olsen Drawer 30",2014-016207,SPM012974,"Apamea sordens","Rustic Shoulder Knot Apamea",Iowa,Marshall,2008-06-19,,"Marietta Sand Prairie State Preserve",42.099164,-93.038965,"Frank Olsen",adult,,Pinned,1,,,,,,,,,"Located at Iowa State"
16039,"Frank Olsen Drawer 55",2014-016337,SPM024514,"Apantesis phalerata-nais-carlotta-vittata","Tiger Moth",Iowa,Marshall,2011-08-31,,"Marietta Sand Prairie State Preserve",42.099164,-93.038965,"Frank Olsen",adult,,Pinned,1,,,,,,,,,"Located at Iowa State"
16040,"Frank Olsen Drawer 55",2014-016338,SPM024515,"Apantesis phalerata-nais-carlotta-vittata","Tiger Moth",Iowa,Marshall,2011-08-31,,"Marietta Sand Prairie State Preserve",42.099164,-93.038965,"Frank Olsen",adult,,Pinned,1,,,,,,,,,"Located at Iowa State"
17103,,2014-017402,SPM035437,"Ascalapha odorata","Black Witch Moth",Iowa,Marshall,2013-08-02,,"Elmwood County Club",42.02667,-92.9375,"Marshall Ryan",adult,,Photograph,1,,,,,,,,,
17249,,2014-017548,SPM036952,"Atteva aurea","Ailanthus Webworm Moth",Iowa,Marshall,2010-07-07,,Redacted,Redacted,Redacted,"Carl Kurtz",adult,,Photograph,1,,,,,,,,,
17726,,2014-018026,SPM036975,"Biston betularia","Pepper and Salt Geometer",Iowa,Marshall,1980-06-01,,Redacted,Redacted,Redacted,"Carl Kurtz",adult,,Photograph,1,,,,,,,,,
18142,,2014-018442,SPM036946,"Caenurgina erechtea","Forage Looper Moth",Iowa,Marshall,2012-07-31,,Redacted,Redacted,Redacted,"Carl Kurtz",adult,,Photograph,1,,,,,,,,,
18143,,2014-018443,SPM036964,"Caenurgina erechtea","Forage Looper Moth",Iowa,Marshall,2006-08-15,,Redacted,Redacted,Redacted,"Carl Kurtz",adult,,Photograph,1,,,,,,,,,
18331,,2014-018637,SPM039261,"Callosamia promethea","Promethea Moth",Iowa,Marshall,2013-03-16,,"Roadside, 220th St-x",42.03194,-92.78833,"Tom Jantscher",adult,,Sighting,1,,,,,,,,,
18332,,2014-018638,SPM039263,"Callosamia promethea","Promethea Moth",Iowa,Marshall,2013-03-16,,"Twinkle Hill Prairie",42.06417,-92.85861,"Tom Jantscher",adult,,Sighting,1,,,,,,,,,
18626,,2014-018949,SPM036936,"Campaea perlata","Pale Beauty",Iowa,Marshall,2013-08-21,,Redacted,Redacted,Redacted,"Carl Kurtz",adult,,Photograph,1,,,,,,,,,
19798,,2014-020129,SPM013037,"Celypha cespitana","Celypha Moth",Iowa,Marshall,2008-06-19,,"Marietta Sand Prairie State Preserve",42.099164,-93.038965,"Frank Olsen",adult,,Pinned,1,,,,,,,,,"Located at Iowa State"
20545,"Frank Olsen Drawer 44",2014-020882,SPM025044,"Chlorochlamys chloroleucaria","Blackberry Looper Moth",Iowa,Marshall,2011-06-01,,"Marietta Sand Prairie State Preserve",42.099164,-93.038965,"Frank Olsen",adult,,Pinned,1,,,,,,,,,"Located at Iowa State"
20546,"Frank Olsen Drawer 44",2014-020883,SPM025045,"Chlorochlamys chloroleucaria","Blackberry Looper Moth",Iowa,Marshall,2011-06-01,,"Marietta Sand Prairie State Preserve",42.099164,-93.038965,"Frank Olsen",adult,,Pinned,1,,,,,,,,,"Located at Iowa State"
20572,,2014-020909,SPM036958,"Chlorochlamys chloroleucaria","Blackberry Looper Moth",Iowa,Marshall,2006-08-21,,Redacted,Redacted,Redacted,"Carl Kurtz",adult,,Photograph,1,,,,,,,,,
20787,,2014-021124,SPM024588,"Autographa precationis","The Common Looper Moth",Iowa,Marshall,2011-08-11,,"Marietta Sand Prairie State Preserve",42.099164,-93.038965,"Frank Olsen",adult,,Photograph,1,,,,,,,,,
20987,,2014-021324,SPM017698,"Cicindela formosa","Big Sand Tiger Beetle",Iowa,Marshall,2010-05-22,,"Marietta Sand Prairie State Preserve",42.09467,-93.03833,"Aaron Brees",adult,,Photograph,1,,,,,,,,,
21044,,2014-021381,SPM017703,"Cicindela scutellaris","Festive Tiger Beetle",Iowa,Marshall,2010-05-22,,"Marietta Sand Prairie State Preserve",42.09467,-93.03833,"Aaron Brees",adult,,Photograph,1,,,,,,,,,
21838,"Frank Olsen Drawer 34",2014-022175,SPM024726,"Condica videns","White-dotted Groundling",Iowa,Marshall,2011-06-01,,"Marietta Sand Prairie State Preserve",42.099164,-93.038965,"Frank Olsen",adult,,Pinned,1,,,,,,,,,"Located at Iowa State"
21839,"Frank Olsen Drawer 34",2014-022176,SPM024727,"Condica videns","White-dotted Groundling",Iowa,Marshall,2011-06-01,,"Marietta Sand Prairie State Preserve",42.099164,-93.038965,"Frank Olsen",adult,,Pinned,1,,,,,,,,,"Located at Iowa State"
21843,"Frank Olsen Drawer 34",2014-022180,SPM024953,"Condica videns","White-dotted Groundling",Iowa,Marshall,2011-08-31,,"Marietta Sand Prairie State Preserve",42.099164,-93.038965,"Frank Olsen",adult,,Pinned,1,,,,,,,,,"Located at Iowa State"
23480,,2014-023826,SPM036955,"Desmia funeralis-maculalis",None,Iowa,Marshall,2007-06-07,,Redacted,Redacted,Redacted,"Carl Kurtz",adult,,Photograph,1,,,,,,,,,
24241,,2014-024587,SPM036976,"Dryocampa rubicunda","Rosy Maple Moth",Iowa,Marshall,1980-06-01,,Redacted,Redacted,Redacted,"Carl Kurtz",adult,,Photograph,1,,,,,,,,,
24463,"Frank Olsen Drawer 19",2014-024810,SPM012744,"Ectropis crepuscularia","The Small Engrailed",Iowa,Marshall,2008-06-19,,"Marietta Sand Prairie State Preserve",42.099164,-93.038965,"Frank Olsen",adult,,Pinned,1,,,,,,,,,"Located at Iowa State"
25364,"Frank Olsen Drawer 49",2014-025711,SPM013329,"Epiblema benignata",None,Iowa,Marshall,2008-06-19,,"Marietta Sand Prairie State Preserve",42.099164,-93.038965,"Frank Olsen",adult,,Pinned,1,,,,,,,,,"Located at Iowa State"
25979,,2014-026327,SPM036971,"Estigmene acrea","Salt Marsh Moth",Iowa,Marshall,2006-07-28,,Redacted,Redacted,Redacted,"Carl Kurtz",adult,,Photograph,1,,,,,,,,,
27135,,2014-027488,SPM036938,"Euphyia intermediata","Sharp-angled Carpet",Iowa,Marshall,2013-08-21,,Redacted,Redacted,Redacted,"Carl Kurtz",adult,,Photograph,1,,,,,,,,,
27530,,2014-027883,SPM036954,"Eustixia pupula","Spotted Peppergrass Moth",Iowa,Marshall,2007-06-15,,Redacted,Redacted,Redacted,"Carl Kurtz",adult,,Photograph,1,,,,,,,,,
27918,"Frank Olsen Drawer 07",2014-028271,SPM025218,"Feltia jaculifera","Dingy Cutworm Moth",Iowa,Marshall,2011-08-31,,"Marietta Sand Prairie State Preserve",42.099164,-93.038965,"Frank Olsen",adult,,Pinned,1,,,,,,,,,"Located at Iowa State"
28851,,2014-029204,SPM036943,"Haematopis grataria","Chickweed Geometer",Iowa,Marshall,2013-08-21,,Redacted,Redacted,Redacted,"Carl Kurtz",adult,,Photograph,1,,,,,,,,,
28852,,2014-029205,SPM036957,"Haematopis grataria","Chickweed Geometer",Iowa,Marshall,2006-08-21,,Redacted,Redacted,Redacted,"Carl Kurtz",adult,,Photograph,1,,,,,,,,,
28853,,2014-029206,SPM036959,"Haematopis grataria","Chickweed Geometer",Iowa,Marshall,2006-08-21,,Redacted,Redacted,Redacted,"Carl Kurtz",adult,,Photograph,1,,,,,,,,,
29270,"Frank Olsen Drawer 52",2014-029623,SPM007417,"Haploa reversa","Reversed Hapola Moth",Iowa,Marshall,1989-07-15,,"Marietta Sand Prairie State Preserve",42.09467,-93.03833,"Tim Orwig",adult,,Pinned,1,,,,,,,,,"Located at Iowa State"
29506,,2014-029859,SPM036950,"Helicoverpa zea","Corn Earworm Moth",Iowa,Marshall,2011-09-12,,Redacted,Redacted,Redacted,"Carl Kurtz",adult,,Photograph,1,,,,,,,,,