ID,"Collection / Source","Catalog Number","Specify Number",Taxon,"Common Name",State,County,Date,Time,Locale,Latitude,Longitude,Collector,"Life Stage","Collection Method","Preparation Type",Count,Temperature,Humidity,"Dew Point",Wind,"Wind Direction","Barometric Pressure",Sky,"Moon Phase",Notes
39187,,2014-039561,SPM007886,"Ostrinia nubilalis","European Corn Borer Moth",Iowa,Muscatine,2006-05-23,,"Wildcat Den State Park",41.4705,-90.88228,"Frank Olsen",adult,,Photograph,1,,,,,,,,,
39188,,2014-039562,SPM007887,"Ostrinia penitalis","American Lotus Borer Moth",Iowa,Muscatine,2006-08-08,,"Wildcat Den State Park",41.4705,-90.88228,"Frank Olsen",adult,,Photograph,1,,,,,,,,,
39307,"Jim Durbin Drawer 037",2014-039681,SPM015641,"Ostrinia obumbratalis","Smartweed Borer Moth",Iowa,Muscatine,2009-08-04,,"Shady Creek Recreation Area",41.44813,-90.8732,"Jim Durbin",adult,Blacklight/Fluorescent,Pinned,1,,,,,,,,,
338058,,,,"Ostrinia penitalis","American Lotus Borer Moth",Iowa,Muscatine,2023-07-18,21:29:07,"Big Sand Mound Prairie Preserve, Muscatine County",41.34026787,-91.08103262,"Jim Durbin",adult,Blacklight/Fluorescent,Photograph,1,72,70,62,0,90,29.99,"partly cloudy","new moon",
338069,,,,"Ostrinia penitalis","American Lotus Borer Moth",Iowa,Muscatine,2023-07-18,21:43:49,"Big Sand Mound Prairie Preserve, Muscatine County",41.34026787,-91.08103262,"Jim Durbin",adult,Blacklight/Fluorescent,Photograph,1,72,70,62,0,90,29.99,"partly cloudy","new moon",
338072,,,,"Ostrinia penitalis","American Lotus Borer Moth",Iowa,Muscatine,2023-07-18,21:45:30,"Big Sand Mound Prairie Preserve, Muscatine County",41.34026787,-91.08103262,"Jim Durbin",adult,Blacklight/Fluorescent,Photograph,1,72,70,62,0,90,29.99,"partly cloudy","new moon",
338147,,,,"Ostrinia penitalis","American Lotus Borer Moth",Iowa,Muscatine,2023-07-18,23:05:57,"Big Sand Mound Prairie Preserve, Muscatine County",41.34026787,-91.08103262,"Jim Durbin",adult,Blacklight/Fluorescent,Photograph,1,72,70,62,0,90,29.99,"partly cloudy","new moon",
339897,,,,"Ostrinia penitalis","American Lotus Borer Moth",Iowa,Muscatine,2023-08-17,22:27:20,"Big Sand Mound Prairie Preserve, Muscatine County",41.34031372,-91.0810559,"Jim Durbin",adult,Blacklight/Fluorescent,Photograph,1,69,66,57,0,0,29.93,clear,"new moon",
339911,,,,"Ostrinia penitalis","American Lotus Borer Moth",Iowa,Muscatine,2023-08-17,22:33:33,"Big Sand Mound Prairie Preserve, Muscatine County",41.34031372,-91.0810559,"Jim Durbin",adult,Blacklight/Fluorescent,Photograph,1,69,66,57,0,0,29.93,clear,"new moon",
