ID,"Collection / Source","Catalog Number","Specify Number",Taxon,"Common Name",State,County,Date,Time,Locale,Latitude,Longitude,Collector,"Life Stage","Collection Method","Preparation Type",Count,Temperature,Humidity,"Dew Point",Wind,"Wind Direction","Barometric Pressure",Sky,"Moon Phase",Notes
16654,"Frank Olsen Drawer 49",2014-016952,SPM002953,"Argyrotaenia alisellana","White-spotted Leafroller Moth",Iowa,Muscatine,2004-06-06,,"Wildcat Den State Park",41.4705,-90.88228,"Frank Olsen",adult,,Pinned,1,,,,,,,,,"Located at Iowa State"
16720,"Jim Durbin Drawer 021",2014-017018,SPM015689,"Argyrotaenia quercifoliana","Yellow-winged Oak Leafroller Moth",Iowa,Muscatine,2009-08-04,,"Shady Creek Recreation Area",41.44813,-90.8732,"Jim Durbin",adult,Blacklight/Fluorescent,Pinned,1,,,,,,,,,
16721,"Jim Durbin Drawer 021",2014-017019,SPM015692,"Argyrotaenia quercifoliana","Yellow-winged Oak Leafroller Moth",Iowa,Muscatine,2009-08-04,,"Shady Creek Recreation Area",41.44813,-90.8732,"Jim Durbin",adult,Blacklight/Fluorescent,Pinned,1,,,,,,,,,
16722,"Jim Durbin Drawer 021",2014-017020,SPM015707,"Argyrotaenia quercifoliana","Yellow-winged Oak Leafroller Moth",Iowa,Muscatine,2009-08-04,,"Shady Creek Recreation Area",41.44813,-90.8732,"Jim Durbin",adult,Blacklight/Fluorescent,Pinned,1,,,,,,,,,
16764,"Frank Olsen Drawer 49",2014-017063,SPM013034,"Argyrotaenia velutinana","Red Banded Leafroller Moth",Iowa,Muscatine,2008-05-01,,"Wildcat Den State Park",41.4705,-90.88228,"Frank Olsen",adult,,Pinned,1,,,,,,,,,"Located at Iowa State"
16765,"Frank Olsen Drawer 49",2014-017064,SPM013035,"Argyrotaenia velutinana","Red Banded Leafroller Moth",Iowa,Muscatine,2008-05-01,,"Wildcat Den State Park",41.4705,-90.88228,"Frank Olsen",adult,,Pinned,1,,,,,,,,,"Located at Iowa State"
135283,,2015-025877,,"Argyrotaenia quercifoliana","Yellow-winged Oak Leafroller Moth",Iowa,Muscatine,2005-06-26,,"Wildcat Den State Park",41.4705,-90.88228,"Frank Olsen",adult,,Pinned,1,,,,,,,,,"Located at Iowa State"
135298,,2015-025892,,"Argyrotaenia velutinana","Red Banded Leafroller Moth",Iowa,Muscatine,2007-04-02,,"Wildcat Den State Park",41.4705,-90.88228,"Frank Olsen",adult,,Pinned,1,,,,,,,,,"Located at Iowa State"
335475,,,,"Argyrotaenia velutinana","Red Banded Leafroller Moth",Iowa,Muscatine,2023-06-21,22:23:44,"Big Sand Mound Prairie Preserve, Muscatine County",41.342624268333,-91.086409253333,"Jim Durbin",adult,Blacklight/Fluorescent,Photograph,1,80,56,63,0,90,30.01,clear,"10% visible",
335477,,,,"Argyrotaenia velutinana","Red Banded Leafroller Moth",Iowa,Muscatine,2023-06-21,22:24:14,"Big Sand Mound Prairie Preserve, Muscatine County",41.342624268333,-91.086409253333,"Jim Durbin",adult,Blacklight/Fluorescent,Photograph,1,80,56,63,0,90,30.01,clear,"10% visible",
335521,,,,"Argyrotaenia velutinana","Red Banded Leafroller Moth",Iowa,Muscatine,2023-06-21,22:49:08,"Big Sand Mound Prairie Preserve, Muscatine County",41.342624268333,-91.086409253333,"Jim Durbin",adult,Blacklight/Fluorescent,Photograph,1,80,56,63,0,90,30.01,clear,"10% visible",
339841,,,,"Argyrotaenia velutinana","Red Banded Leafroller Moth",Iowa,Muscatine,2023-08-17,21:51:57,"Big Sand Mound Prairie Preserve, Muscatine County",41.34031372,-91.0810559,"Jim Durbin",adult,Blacklight/Fluorescent,Photograph,1,69,66,57,0,0,29.93,clear,"new moon",
339864,,,,"Argyrotaenia juglandana","Hickory Leafroller Moth",Iowa,Muscatine,2023-08-17,22:00:36,"Big Sand Mound Prairie Preserve, Muscatine County",41.34031372,-91.0810559,"Jim Durbin",adult,Blacklight/Fluorescent,Photograph,1,69,66,57,0,0,29.93,clear,"new moon",
339867,,,,"Argyrotaenia velutinana","Red Banded Leafroller Moth",Iowa,Muscatine,2023-08-17,22:01:40,"Big Sand Mound Prairie Preserve, Muscatine County",41.34031372,-91.0810559,"Jim Durbin",adult,Blacklight/Fluorescent,Photograph,1,69,66,57,0,0,29.93,clear,"new moon",
339872,,,,"Argyrotaenia velutinana","Red Banded Leafroller Moth",Iowa,Muscatine,2023-08-17,22:03:10,"Big Sand Mound Prairie Preserve, Muscatine County",41.34031372,-91.0810559,"Jim Durbin",adult,Blacklight/Fluorescent,Photograph,1,69,66,57,0,0,29.93,clear,"new moon",
339919,,,,"Argyrotaenia velutinana","Red Banded Leafroller Moth",Iowa,Muscatine,2023-08-17,22:38:21,"Big Sand Mound Prairie Preserve, Muscatine County",41.34031372,-91.0810559,"Jim Durbin",adult,Blacklight/Fluorescent,Photograph,1,69,66,57,0,0,29.93,clear,"new moon",
