ID,"Collection / Source","Catalog Number","Specify Number",Taxon,"Common Name",State,County,Date,Time,Locale,Latitude,Longitude,Collector,"Life Stage","Collection Method","Preparation Type",Count,Temperature,Humidity,"Dew Point",Wind,"Wind Direction","Barometric Pressure",Sky,"Moon Phase",Notes
1710,,2014-001991,,"Anatrytone logan","Delaware Skipper",Iowa,O'Brien,1950-07-01,,"O'Brien County",43.113125,-95.645798," USGS - NPWRC",adult,Sighting,Sighting,1,,,,,,,,,"HIstorical Record"
1783,,2014-002064,,"Ancyloxypha numitor","Least Skipper",Iowa,O'Brien,1950-08-01,,"O'Brien County",43.113125,-95.645798," USGS - NPWRC",adult,Sighting,Sighting,1,,,,,,,,,"HIstorical Record"
1967,,2014-002248,,"Atalopedes campestris",Sachem,Iowa,O'Brien,1950-09-10,,"O'Brien County",43.113125,-95.645798," USGS - NPWRC",adult,Sighting,Sighting,1,,,,,,,,,"HIstorical Record"
2002,,2014-002283,,"Atrytone arogos","Arogos Skipper",Iowa,O'Brien,1950-07-15,,"O'Brien County",43.113125,-95.645798," USGS - NPWRC",adult,Sighting,Sighting,1,,,,,,,,,"Historical Record"
3063,,2014-003344,,"Erynnis martialis","Mottled Duskywing",Iowa,O'Brien,1950-05-20,,"O'Brien County",43.113125,-95.645798," USGS - NPWRC",adult,Sighting,Sighting,1,,,,,,,,,"HIstorical Record"
3591,,2014-003872,,"Hylephila phyleus","Fiery Skipper",Iowa,O'Brien,1950-09-01,,"O'Brien County",43.113125,-95.645798," USGS - NPWRC",adult,Sighting,Sighting,1,,,,,,,,,"HIstorical Record"
4729,,2014-005010,,"Pholisora catullus","Common Sootywing",Iowa,O'Brien,1950-08-01,,"O'Brien County",43.113125,-95.645798," USGS - NPWRC",adult,Sighting,Sighting,1,,,,,,,,,"HIstorical Record"
5073,,2014-005354,,"Polites mystic","Long Dash",Iowa,O'Brien,1950-06-15,,"O'Brien County",43.113125,-95.645798," USGS - NPWRC",adult,Sighting,Sighting,1,,,,,,,,,"HIstorical Record"
5114,,2014-005395,,"Polites origenes","Cross-line Skipper",Iowa,O'Brien,1950-07-01,,"O'Brien County",43.113125,-95.645798," USGS - NPWRC",adult,Sighting,Sighting,1,,,,,,,,,"HIstorical Record"
5170,,2014-005451,,"Polites coras","Peck's Skipper",Iowa,O'Brien,1950-07-30,,"O'Brien County",43.113125,-95.645798," USGS - NPWRC",adult,Sighting,Sighting,1,,,,,,,,,"HIstorical Record"
5247,,2014-005528,,"Polites themistocles","Tawny-edged Skipper",Iowa,O'Brien,1950-08-01,,"O'Brien County",43.113125,-95.645798," USGS - NPWRC",adult,Sighting,Sighting,1,,,,,,,,,"HIstorical Record"
5578,,2014-005859,,"Burnsius communis","Common Checkered Skipper",Iowa,O'Brien,1950-09-01,,"O'Brien County",43.113125,-95.645798," USGS - NPWRC",adult,Sighting,Sighting,1,,,,,,,,,"HIstorical Record"
50986,,2014-051368,,"Atrytone arogos","Arogos Skipper",Iowa,O'Brien,1989-07-07,,"O'Brien County",43.1131,-95.6458,"Tim Orwig",adult,Sighting,Sighting,1,,,,,,,,,
54964,,2014-055346,,"Erynnis baptisiae","Wild Indigo Duskywing",Iowa,O'Brien,1950-08-20,,"O'Brien County",43.1131,-95.6458,"Tim Orwig",adult,Sighting,Sighting,1,,,,,,,,,"HIstorical Record"
58634,,2014-059016,,"Oarisma poweshiek","Poweshiek Skipperling",Iowa,O'Brien,1988-06-27,,"O'Brien County",43.1131,-95.6458,"Tim Orwig",adult,Sighting,Sighting,1,,,,,,,,,
59443,,2014-060044,,"Pholisora catullus","Common Sootywing",Iowa,O'Brien,1950-08-01,,"O'Brien County",43.1131,-95.6458,"Tim Orwig",adult,Sighting,Sighting,1,,,,,,,,,"HIstorical Record"
61532,,2014-062133,,"Polites themistocles","Tawny-edged Skipper",Iowa,O'Brien,1950-08-01,,"O'Brien County",43.1131,-95.6458,"Tim Orwig",adult,Sighting,Sighting,1,,,,,,,,,"HIstorical Record"
106636,,2014-107383,,"Anatrytone logan","Delaware Skipper",Iowa,O'Brien,1993-07-20,,"Indian Village State Park",42.977307,-95.42385,"Mike Saunders",adult,Sighting,Sighting,2,,,,,,,,,
106637,,2014-107384,,"Anatrytone logan","Delaware Skipper",Iowa,O'Brien,1993-07-20,,"Indian Village State Park",42.977307,-95.42385,"Mike Saunders",adult,Sighting,Sighting,1,,,,,,,,,
106711,,2014-107458,,"Atrytone arogos","Arogos Skipper",Iowa,O'Brien,1993-07-20,,"Indian Village State Park",42.977307,-95.42385,"Mike Saunders",adult,Sighting,Sighting,1,,,,,,,,,
106712,,2014-107459,,"Atrytone arogos","Arogos Skipper",Iowa,O'Brien,1989-07-07,,"O'Brien County",43.114408,-95.645526,"Tim Orwig",adult,Sighting,Sighting,1,,,,,,,,,"McCormack Area"
107299,,2014-108046,,"Hylephila phyleus","Fiery Skipper",Iowa,O'Brien,1991-09-16,,"O'Brien County",43.113865,-95.646013,"Ron Harms",adult,Sighting,Sighting,1,,,,,,,,,"Wilkens Farm"
107677,,2014-108424,,"Polites origenes","Cross-line Skipper",Iowa,O'Brien,1993-07-20,,"Indian Village State Park",42.977307,-95.42385,"Mike Saunders",adult,Sighting,Sighting,1,,,,,,,,,
107678,,2014-108425,,"Polites origenes","Cross-line Skipper",Iowa,O'Brien,1993-07-20,,"Indian Village State Park",42.977307,-95.42385,"Mike Saunders",adult,Sighting,Sighting,1,,,,,,,,,
107707,,2014-108454,,"Polites themistocles","Tawny-edged Skipper",Iowa,O'Brien,1993-07-20,,"Indian Village State Park",42.977307,-95.42385,"Mike Saunders",adult,Sighting,Sighting,1,,,,,,,,,
107708,,2014-108455,,"Polites themistocles","Tawny-edged Skipper",Iowa,O'Brien,1994-07-11,,"Indian Village State Park",42.977307,-95.42385,"Mike Saunders",adult,Sighting,Sighting,1,,,,,,,,,
246687,,,,"Polites themistocles","Tawny-edged Skipper",Iowa,O'Brien,1994-07-11,,"Waterman Creek/Little Sioux River",42.980659,-95.426384,"Mike Saunders",,Sighting,Sighting,6,,,,,,,,,
246688,,,,"Polites themistocles","Tawny-edged Skipper",Iowa,O'Brien,2004-07-04,,"Waterman Prairie",42.95739,-95.445261,"Jerry Selby",,Sighting,Sighting,3,,,,,,,,,
247038,,,,"Polites origenes","Cross-line Skipper",Iowa,O'Brien,1993-07-20,,"Waterman Creek/Little Sioux River",42.980314,-95.426427,"Mike Saunders",,Sighting,Sighting,2,,,,,,,,,
247046,,,,"Oarisma poweshiek","Poweshiek Skipperling",Iowa,O'Brien,1994-06-29,,"Waterman Creek/Little Sioux River",42.98075,-95.42679,"Mike Saunders",,Sighting,Sighting,150,,,,,,,,,
249505,,,,"Ancyloxypha numitor","Least Skipper",Iowa,O'Brien,2018-06-19,14:20,"Hannibal Waterman Wildlife Area",42.934706,-95.417254,IBSN,adult,Sighting,Sighting,3,75,,,Calm,,,Overcast,,
249598,,,,"Ancyloxypha numitor","Least Skipper",Iowa,O'brien,2018-06-19,13:35,"Waterman Prairie South",42.91651,-95.441283,IBSN,adult,Sighting,Sighting,2,76,,,"Relatively Still",,,"Mostly Cloudy",,
249599,,,,"Ancyloxypha numitor","Least Skipper",Iowa,O'Brien,2017-10-04,15:00,"Waterman Wildlife Addition",42.936357,-95.420094,IBSN,adult,Sighting,Sighting,1,70,,,"Relatively Still",,,"Mostly Clear",,
249600,,,,"Ancyloxypha numitor","Least Skipper",Iowa,O'Brien,2019-07-06,14:15,"Waterman Wildlife Addition",42.936357,-95.420094,IBSN,adult,Sighting,Sighting,1,85,,,"Relatively Still",,,"Partly Cloudy",,
254938,,,,"Epargyreus clarus","Silver-spotted Skipper",Iowa,O'brien,2018-08-09,11:00,"Waterman Prairie South",42.91651,-95.441283,IBSN,adult,Sighting,Sighting,1,82,,,"Relatively Still",,,Clear,,
254939,,,,"Epargyreus clarus","Silver-spotted Skipper",Iowa,O'Brien,2018-06-06,11:30,"Waterman Wildlife Addition",42.936357,-95.420094,IBSN,adult,Sighting,Sighting,1,83,,,Calm,,,"Partly Cloudy",,
254940,,,,"Epargyreus clarus","Silver-spotted Skipper",Iowa,O'Brien,2018-09-01,14:25,"Waterman Wildlife Addition",42.936357,-95.420094,IBSN,adult,Sighting,Sighting,1,84,,,"Relatively Still",,,"Mostly Cloudy",,
254941,,,,"Epargyreus clarus","Silver-spotted Skipper",Iowa,O'Brien,2019-06-15,10:10,"Waterman Wildlife Addition",42.936357,-95.420094,IBSN,adult,Sighting,Sighting,1,78,,,"Relatively Still",,,"Mostly Cloudy",,
261737,,,,"Burnsius communis","Common Checkered Skipper",Iowa,O'Brien,2017-06-30,12:25,"Waterman Wildlife Addition",42.936357,-95.420094,IBSN,adult,Sighting,Sighting,2,77,,,"Relatively Still",,,"Mostly Clear",,
261738,,,,"Burnsius communis","Common Checkered Skipper",Iowa,O'Brien,2017-07-08,10:45,"Waterman Wildlife Addition",42.936357,-95.420094,IBSN,adult,Sighting,Sighting,2,82,,,"Relatively Still",,,"Partly Cloudy",,
261739,,,,"Burnsius communis","Common Checkered Skipper",Iowa,O'Brien,2017-07-24,11:05,"Waterman Wildlife Addition",42.936357,-95.420094,IBSN,adult,Sighting,Sighting,10,77,,,"Relatively Still",,,"Partly Cloudy",,
261740,,,,"Burnsius communis","Common Checkered Skipper",Iowa,O'Brien,2017-08-24,15:10,"Waterman Wildlife Addition",42.936357,-95.420094,IBSN,adult,Sighting,Sighting,2,75,,,"Relatively Still",,,"Mostly Cloudy",,
261741,,,,"Burnsius communis","Common Checkered Skipper",Iowa,O'Brien,2017-10-04,15:00,"Waterman Wildlife Addition",42.936357,-95.420094,IBSN,adult,Sighting,Sighting,3,70,,,"Relatively Still",,,"Mostly Clear",,
261742,,,,"Burnsius communis","Common Checkered Skipper",Iowa,O'Brien,2018-06-19,14:45,"Waterman Wildlife Addition",42.936357,-95.420094,IBSN,adult,Sighting,Sighting,2,80,,,"Relatively Still",,,"Mostly Cloudy",,
261743,,,,"Burnsius communis","Common Checkered Skipper",Iowa,O'Brien,2018-07-16,11:20,"Waterman Wildlife Addition",42.936357,-95.420094,IBSN,adult,Sighting,Sighting,1,79,,,"Relatively Still",,,"Mostly Clear",,
261744,,,,"Burnsius communis","Common Checkered Skipper",Iowa,O'Brien,2019-06-29,10:00,"Waterman Wildlife Addition",42.936357,-95.420094,IBSN,adult,Sighting,Sighting,4,82,,,"Relatively Still",,,Clear,,
261745,,,,"Burnsius communis","Common Checkered Skipper",Iowa,O'Brien,2019-08-03,11:30,"Waterman Wildlife Addition",42.936357,-95.420094,IBSN,adult,Sighting,Sighting,2,79,,,"Relatively Still",,,"Partly Cloudy",,
261746,,,,"Burnsius communis","Common Checkered Skipper",Iowa,O'Brien,2019-08-10,10:30,"Waterman Wildlife Addition",42.936357,-95.420094,IBSN,adult,Sighting,Sighting,1,73,,,"Relatively Still",,,Overcast,,
318533,,,,"Ancyloxypha numitor","Least Skipper",Iowa,O'Brien,2022-09-04,,"Mill Creek State Park",42.984061,-95.669552,"Jay Gilliam",adult,Sighting,Sighting,1,,,,,,,,,
