ID,"Collection / Source","Catalog Number","Specify Number",Taxon,"Common Name",State,County,Date,Time,Locale,Latitude,Longitude,Collector,"Life Stage","Collection Method","Preparation Type",Count,Temperature,Humidity,"Dew Point",Wind,"Wind Direction","Barometric Pressure",Sky,"Moon Phase",Notes
66095,,2014-066699,,"Cratichneumon viator",None,Iowa,Polk,2014-06-29,,"Red Feather Prairie",41.7241753,-93.6682475,"Mark Brown",adult,,Photograph,1,,,,,,,,,
144627,,2016-009249,,"Tethida barda","Black-headed Ash Sawfly",Iowa,Polk,2012-05-12,,Redacted,Redacted,Redacted,"Mark Brown",adult,,Photograph,1,,,,,,,,,
144629,,2016-009251,,"Ametastegia pallipes","Violet Sawfly",Iowa,Polk,2012-04-14,,Redacted,Redacted,Redacted,"Mark Brown",adult,,Photograph,1,,,,,,,,,
144632,,2016-009254,,"Eumenes fraternus","Fraternal Potter Wasp",Iowa,Polk,2011-09-25,,Redacted,Redacted,Redacted,"Mark Brown",adult,,Photograph,1,,,,,,,,,
144633,,2016-009255,,"Sceliphron caementarium","Black and Yellow Mud Dauber",Iowa,Polk,2011-09-05,,"Chichaqua Bottoms Greenbelt",41.792514,-93.431717,"Mark Brown",adult,,Photograph,1,,,,,,,,,
144644,,2016-009266,,"Polistes dominula","European Paper Wasp",Iowa,Polk,2010-09-04,,Redacted,Redacted,Redacted,"Mark Brown",adult,,Photograph,1,,,,,,,,,
144656,,2016-009278,,"Vespula maculifrons",None,Iowa,Polk,2009-08-23,,Redacted,Redacted,Redacted,"Mark Brown",adult,,Photograph,1,,,,,,,,,
144660,,2016-009282,,"Polistes fuscatus","Northern Paper Wasp",Iowa,Polk,2005-09-17,,Redacted,Redacted,Redacted,"Mark Brown",adult,,Photograph,1,,,,,,,,,
144665,,2016-009287,,"Bombus pensylvanicus","American Bumble Bee",Iowa,Polk,2005-08-20,,Redacted,Redacted,Redacted,"Mark Brown",adult,Sighting,Photograph,1,,,,,,,,,
144672,,2016-009294,,"Lasioglossum zephyrus",None,Iowa,Polk,2014-09-07,,Redacted,Redacted,Redacted,"Mark Brown",adult,,Photograph,1,,,,,,,,,
144673,,2016-009295,,"Xylocopa virginica","Eastern Carpenter Bee",Iowa,Polk,2014-09-06,,Redacted,Redacted,Redacted,"Mark Brown",adult,,Photograph,1,,,,,,,,,
144675,,2016-009297,,"Dolichovespula maculata","Baldfaced Hornet",Iowa,Polk,2014-09-06,,"Jester Park",41.792298,-93.78488,"Mark Brown",adult,,Photograph,1,,,,,,,,,
144685,,2016-009307,,"Vespula maculifrons",None,Iowa,Polk,2015-09-20,,"Jester Park",41.792298,-93.78488,"Mark Brown",adult,,Photograph,1,,,,,,,,,
144707,,2016-009329,,"Apis mellifera","Honey Bee",Iowa,Polk,2015-08-16,,"Big Creek State Park",41.807055,-93.745185,"Mark Brown",adult,,Photograph,1,,,,,,,,,
144708,,2016-009330,,"Camponotus pennsylvanicus","Eastern Black Carpenter Ant",Iowa,Polk,2013-09-02,,"Carney Marsh Nature Preserve",41.688625,-93.593193,"Mark Brown",adult,,Photograph,1,,,,,,,,,
144709,,2016-009331,,"Svastra obliqua","Sunflower Long-horned Bee",Iowa,Polk,2013-09-01,,"Big Creek State Park",41.807055,-93.745185,"Mark Brown",adult,,Photograph,1,,,,,,,,,
144713,,2016-009335,,"Zethus spinipes",None,Iowa,Polk,2013-08-10,,"Jester Park",41.792298,-93.78488,"Mark Brown",adult,,Photograph,1,,,,,,,,,
144714,,2016-009336,,"Camponotus nearcticus",None,Iowa,Polk,2013-08-10,,"Jester Park",41.792298,-93.78488,"Mark Brown",adult,,Photograph,1,,,,,,,,,
144715,,2016-009337,,"Scolia bicincta",None,Iowa,Polk,2013-08-10,,"Jester Park",41.792298,-93.78488,"Mark Brown",adult,,Photograph,1,,,,,,,,,
144716,,2016-009338,,"Sphecius speciosus","Cicada Killer",Iowa,Polk,2013-08-10,,Redacted,Redacted,Redacted,"Mark Brown",adult,,Photograph,1,,,,,,,,,
144717,,2016-009339,,"Pseudodynerus quadrisectus",None,Iowa,Polk,2013-08-10,,"Jester Park",41.792298,-93.78488,"Mark Brown",adult,,Photograph,1,,,,,,,,,
144718,,2016-009340,,"Melissodes desponsus",None,Iowa,Polk,2015-08-16,,"Big Creek State Park",41.807055,-93.745185,"Mark Brown",adult,,Photograph,1,,,,,,,,,
144719,,2016-009341,,"Philanthus bilunatus",None,Iowa,Polk,2013-07-27,,"Big Creek State Park",41.807055,-93.745185,"Mark Brown",adult,,Photograph,1,,,,,,,,,
144720,,2016-009342,,"Apis mellifera","Honey Bee",Iowa,Polk,2013-07-27,,"Big Creek State Park",41.807055,-93.745185,"Mark Brown",adult,,Photograph,1,,,,,,,,,
144721,,2016-009343,,"Halictus rubicundus","Orange-legged Furrow Bee",Iowa,Polk,2013-07-27,,Redacted,Redacted,Redacted,"Mark Brown",adult,,Photograph,1,,,,,,,,,
144722,,2016-009344,,"Cymodusa distincta",None,Iowa,Polk,2013-07-27,,Redacted,Redacted,Redacted,"Mark Brown",adult,,Photograph,1,,,,,,,,,
144723,,2016-009345,,"Polistes metricus",None,Iowa,Polk,2013-07-27,,"Big Creek State Park",41.807055,-93.745185,"Mark Brown",adult,,Photograph,1,,,,,,,,,
144724,,2016-009346,,"Formica incerta",None,Iowa,Polk,2013-07-27,,"Big Creek State Park",41.807055,-93.745185,"Mark Brown",adult,,Photograph,1,,,,,,,,,
144725,,2016-009347,,"Euodynerus hidalgo",None,Iowa,Polk,2013-07-27,,"Big Creek State Park",41.807055,-93.745185,"Mark Brown",adult,,Photograph,1,,,,,,,,,
144726,,2016-009348,,"Eremnophila aureonotata",None,Iowa,Polk,2013-07-27,,"Big Creek State Park",41.807055,-93.745185,"Mark Brown",adult,,Photograph,1,,,,,,,,,
144739,,2016-009361,,"Anthidium oblongatum",None,Iowa,Polk,2012-09-01,,Redacted,Redacted,Redacted,"Mark Brown",adult,,Photograph,1,,,,,,,,,
144745,,2016-009367,,"Formica subsericea",None,Iowa,Polk,2012-07-15,,"Big Creek State Park",41.807055,-93.745185,"Mark Brown",adult,,Photograph,1,,,,,,,,,
144746,,2016-009368,,"Formica pallidefulva",None,Iowa,Polk,2012-07-15,,"Big Creek State Park",41.807055,-93.745185,"Mark Brown",adult,,Photograph,1,,,,,,,,,
144747,,2016-009369,,"Formica dolosa",None,Iowa,Polk,2012-07-15,,"Big Creek State Park",41.807055,-93.745185,"Mark Brown",adult,,Photograph,1,,,,,,,,,
144748,,2016-009370,,"Sphecius speciosus","Cicada Killer",Iowa,Polk,2012-07-15,,"Big Creek State Park",41.807055,-93.745185,"Mark Brown",adult,,Photograph,1,,,,,,,,,
181945,,2016-046693,,"Polistes metricus",None,Iowa,Polk,2016-08-07,,"Big Creek State Park",41.807055,-93.745185,"Mark Brown",adult,,Photograph,1,,,,,,,,,
182283,,2017-000244,,"Lasioglossum zephyrus",None,Iowa,Polk,2014-09-07,,Redacted,Redacted,Redacted,"Mark Brown",adult,,Photograph,1,,,,,,,,,
182324,,2017-000285,,"Xylocopa virginica","Eastern Carpenter Bee",Iowa,Polk,2014-09-06,,Redacted,Redacted,Redacted,"Mark Brown",adult,,Photograph,1,,,,,,,,,
184361,,2017-002322,,"Nomada erigeronis",None,Iowa,Polk,2014-06-28,,"Big Creek State Park",41.807055,-93.745185,"Mark Brown",adult,,Photograph,1,,,,,,,,,
184362,,2017-002323,,"Tachytes guatemalensis",None,Iowa,Polk,2016-08-06,,"Big Creek State Park",41.807055,-93.745185,"Mark Brown",adult,,Photograph,1,,,,,,,,,
186118,,2017-004079,,"Lasioglossum zephyrus",None,Iowa,Polk,2014-09-07,,Redacted,Redacted,Redacted,"Mark Brown",adult,,Photograph,1,,,,,,,,,
186159,,2017-004120,,"Xylocopa virginica","Eastern Carpenter Bee",Iowa,Polk,2014-09-06,,Redacted,Redacted,Redacted,"Mark Brown",adult,,Photograph,1,,,,,,,,,
201961,,2018-000107,,"Sphecius speciosus","Cicada Killer",Iowa,Polk,2017-08-20,,Johnston,41.6689,-93.7055,"Dennis Thompson",adult,,Photograph,1,,,,,,,,,
202611,,2018-000757,,"Polistes dominula","European Paper Wasp",Iowa,Polk,2017-07-29,,Redacted,Redacted,Redacted,"Mark Brown",adult,,Photograph,1,,,,,,,,,
225553,,2019-000465,,"Macremphytus tarsatus","Dogwood Sawfly",Iowa,Polk,2018-07-29,,"Red Feather Prairie",41.7206566,-93.6692402,"Mark Brown",adult,,Photograph,1,,,,,,,,,
227622,,2019-002342,,"Cladius difformis","Bristly Rose Slug",Iowa,Polk,2018-10-27,,Redacted,Redacted,Redacted,"Mark Brown",adult,,Photograph,1,,,,,,,,,
230023,,2019-004735,,"Sphex pensylvanicus","Great Black Wasp",Iowa,Polk,2018-07-25,,"Des Moines-x",41.646696,-93.5531,"Robin Boggs",adult,,Sighting,1,,,,,,,,,
238391,,,,"Polistes metricus",None,Iowa,Polk,2019-09-01,,"Cottonwood Recreation Area",41.694164,-93.67387,"Mark Brown",adult,Sighting,Photograph,1,,,,,,,,,
238404,,,,"Scolia bicincta",None,Iowa,Polk,2019-09-01,,"Saylorville Visitor Center",41.707482,-93.671472,"Mark Brown",adult,Sighting,Photograph,1,,,,,,,,,
247316,,,,"Myzinum maculatum",None,Iowa,Polk,2019-09-01,18:18:15,"Saylorville Visitor Center",41.707983,-93.671168,"Mark Brown",adult,Sighting,Photograph,1,,,,,,,,,
247317,,,,"Gasteruption assectator-kirbii",None,Iowa,Polk,2019-09-01,18:18:15,"Saylorville Visitor Center",41.707983,-93.671168,"Mark Brown",adult,Sighting,Photograph,1,,,,,,,,,
247320,,,,"Eremnophila aureonotata",None,Iowa,Polk,2019-09-01,18:18:15,"Saylorville Visitor Center",41.707983,-93.671168,"Mark Brown",adult,Sighting,Photograph,1,,,,,,,,,
247321,,,,"Bombus impatiens","Common Eastern Bumble Bee",Iowa,Polk,2019-09-01,18:18:15,"Saylorville Visitor Center",41.707983,-93.671168,"Mark Brown",adult,Sighting,Photograph,1,,,,,,,,,
247322,,,,"Cerceris insolita",None,Iowa,Polk,2019-09-01,18:18:15,"Saylorville Visitor Center",41.707983,-93.671168,"Mark Brown",adult,Sighting,Photograph,1,,,,,,,,,
247327,,,,"Zethus spinipes",None,Iowa,Polk,2019-08-31,18:18:15,"Trestle Trail, Thai Village, Des Moines",41.635768,-93.651807,"Mark Brown",adult,Sighting,Photograph,1,,,,,,,,,
247345,,,,"Melissodes bimaculata","Two-spotted Longhorn Bee",Iowa,Polk,2019-07-28,6:08:42,Redacted,Redacted,Redacted,"Mark Brown",adult,"Building Light",Photograph,1,,,,,,,,,
249136,,,,"Bombus griseocollis","Brown-belted Bumble Bee",Iowa,Polk,2011-07-29,,"Chichaqua Bottoms Greenbelt",41.792885,-93.429428,"Moni Hayne",adult,,Photograph,1,,,,,,,,,
268616,,,,"Bombus pensylvanicus","American Bumble Bee",Iowa,Polk,2020-05-31,14:23:41,Redacted,Redacted,Redacted,"John Tow",adult,Sighting,Photograph,1,,,,,,,,,
269336,,,,"Bicyrtes quadrifasciatus","Four-banded Stink Bug Wasp",Iowa,Polk,2020-07-27,13:44,"Chichaqua Bottoms Greenbelt",41.776901,-93.420686,"Jay Gilliam",adult,Sighting,Photograph,1,,,,,,,,,"Chichaqua Bottoms Greenbelt"
271609,,,,"Bombus impatiens","Common Eastern Bumble Bee",Iowa,Polk,2020-08-08,15:36:23,Redacted,Redacted,Redacted,"Mark Brown",adult,Sighting,Photograph,1,,,,,,,,,
276435,,,,"Polistes dominula","European Paper Wasp",Iowa,Polk,2020-10-23,,"Capitol Park",41.598712,-93.609757,"John Tow",adult,Sighting,Photograph,1,,,,,,,,,"Baby Yellow Jacket, 1/8"" long."
289258,,,,"Bombus pensylvanicus","American Bumble Bee",Iowa,Polk,2021-06-18,12:54:36,Redacted,Redacted,Redacted,"Sarah Nizzi",adult,Sighting,Photograph,1,,,,,,,,,
295614,,,,"Sphex ichneumoneus","Great Golden Digger Wasp",Iowa,Polk,2021-06-27,14:45:09,Redacted,Redacted,Redacted,"Mark Brown",adult,Sighting,Photograph,1,,,,,,,,,
296283,,,,"Bicyrtes quadrifasciatus","Four-banded Stink Bug Wasp",Iowa,Polk,2021-06-27,6:39:25,Redacted,Redacted,Redacted,"Mark Brown",adult,Sighting,Photograph,1,,,,,,,,,
296285,,,,"Ectemnius continuus",None,Iowa,Polk,2021-06-27,6:39:25,Redacted,Redacted,Redacted,"Mark Brown",adult,Sighting,Photograph,1,,,,,,,,,
296291,,,,"Cerceris nigrescens",None,Iowa,Polk,2021-06-27,6:39:25,Redacted,Redacted,Redacted,"Mark Brown",adult,Sighting,Photograph,1,,,,,,,,,
311686,,,,"Sphex pensylvanicus","Great Black Wasp",Iowa,Polk,2022-07-07,,"Des Moines-x",41.581239,-93.625564,"Jeff Ewoldt",adult,Sighting,Photograph,1,,,,,,,,,
311687,,,,"Sphex ichneumoneus","Great Golden Digger Wasp",Iowa,Polk,2022-07-07,,"Des Moines-x",41.581239,-93.625564,"Jeff Ewoldt",adult,Sighting,Photograph,1,,,,,,,,,
316282,,,,"Cratichneumon sublatus",None,Iowa,Polk,2014-06-29,,"Saylorville Visitor Center",41.71027,-93.670055,"Mark Brown",adult,Sighting,Photograph,1,,,,,,,,,
319923,,,,"Polistes fuscatus","Northern Paper Wasp",Iowa,Polk,2022-06-11,,"Chichaqua Bottoms- Clingan Grassland Unit",41.777616,-93.355846,"Jay Gilliam",adult,Sighting,Photograph,1,,,,,,,,,
332966,,,,"Sphex ichneumoneus","Great Golden Digger Wasp",Iowa,Polk,2022-09-03,12:19:19,"Trestle Trail, Thai Village, Des Moines",41.634921768333335,-93.65189696833333,"Mark Brown",adult,Sighting,Photograph,1,,,,,,,,,
334343,,,,"Lasius interjectus",None,Iowa,Polk,2023-05-25,02:07:55,"Highland Park",41.624333,-93.6014032,MikeyMouw,adult,Sighting,Photograph,1,,,,,,,,,
335819,,,,"Beegenus undetermined",None,Iowa,Polk,2023-06-25,22:05:10,"Yellow Banks Park",41.54818363,-93.47315852,"Jim Durbin",adult,Blacklight/Fluorescent,Photograph,1,73,67,61,11,270,29.81,clear,"40% visible",
339095,,,,"Beegenus undetermined",None,Iowa,Polk,2023-08-04,1:32:39,Altoona,41.647977,-93.491754,"Rachel Bissett",adult,Sighting,Photograph,1,,,,,,,,,"I have been getting bit in my house so I have been documenting any crawling thing I see. This was my bathroom floor."
341820,,,,"Megarhyssa macrurus","Long-tailed Giant Ichneumonid Wasp",Iowa,Polk,2023-10-04,16:44:25,"Des Moines-x",41.6373361111,-93.66358611,"Dawn Tigas",adult,Sighting,Photograph,1,,,,,,,,,"Elm log damaged during de racho. Des Moines backyard "
341824,,,,"Beegenus undetermined",None,Iowa,Polk,2023-10-03,16:40:49,"Des Moines-x",41.63732361,-93.66364028,"Dawn Tigas",adult,Sighting,Photograph,1,,,,,,,,,
341934,,,,"Ancistrocerus campestris",None,Iowa,Polk,2019-09-01,,"Saylorville Visitor Center",41.7081,-93.670944,"Mark Brown",adult,Sighting,Photograph,1,,,,,,,,,
342255,,,,"Pimpla undetermined",None,Iowa,Polk,2023-06-04,,"Big Creek State Park",41.818791,-93.741212,"Mark Brown",adult,Sighting,Photograph,1,,,,,,,,,"No match on bugguide"
342270,,,,"Alysson guignardi",None,Iowa,Polk,2023-06-04,,"Big Creek State Park",41.818791,-93.741212,"Mark Brown",adult,Sighting,Photograph,1,,,,,,,,,
344689,,,,"Bombus impatiens","Common Eastern Bumble Bee",Iowa,Polk,2023-07-04,,"Terra Park",41.66229,-93.706763,"Jay Gilliam",adult,Sighting,Photograph,1,,,,,,,,,
344690,,,,"Bombus griseocollis","Brown-belted Bumble Bee",Iowa,Polk,2023-07-04,,"Terra Park",41.66229,-93.706763,"Jay Gilliam",adult,Sighting,Photograph,1,,,,,,,,,
344726,,,,"Parazumia symmorpha",None,Iowa,Polk,2023-07-15,,"Chichaqua Bottoms Greenbelt",41.788043,-93.417797,"Jay Gilliam",adult,Sighting,Photograph,1,,,,,,,,,
344729,,,,"Andrena wilkella",None,Iowa,Polk,2023-07-16,,"Dale Maffitt Reservoir",41.514565,-93.783519,"Jay Gilliam",adult,Sighting,Photograph,1,,,,,,,,,
344730,,,,"Halictus confusus",None,Iowa,Polk,2023-07-16,,"Dale Maffitt Reservoir",41.514565,-93.783519,"Jay Gilliam",adult,Sighting,Photograph,1,,,,,,,,,
344731,,,,"Sphex pensylvanicus","Great Black Wasp",Iowa,Polk,2023-07-16,,"Dale Maffitt Reservoir",41.514565,-93.783519,"Jay Gilliam",adult,Sighting,Photograph,1,,,,,,,,,
344733,,,,"Sphex ichneumoneus","Great Golden Digger Wasp",Iowa,Polk,2023-07-16,,"Dale Maffitt Reservoir",41.514565,-93.783519,"Jay Gilliam",adult,Sighting,Photograph,1,,,,,,,,,
344734,,,,"Bombus griseocollis","Brown-belted Bumble Bee",Iowa,Polk,2023-07-16,,"Dale Maffitt Reservoir",41.514565,-93.783519,"Jay Gilliam",adult,Sighting,Photograph,1,,,,,,,,,
344735,,,,"Bombus auricomus","Black-and-Gold Bumble Bee",Iowa,Polk,2023-07-16,,"Dale Maffitt Reservoir",41.514565,-93.783519,"Jay Gilliam",adult,Sighting,Photograph,1,,,,,,,,,
344736,,,,"Bombus auricomus","Black-and-Gold Bumble Bee",Iowa,Polk,2023-12-06,18:22:04,"Dale Maffitt Reservoir",41.514565,-93.783519,"Jay Gilliam",adult,Sighting,Photograph,1,,,,,,,,,
344737,,,,"Formica montana",None,Iowa,Polk,2023-07-16,,"Dale Maffitt Reservoir",41.514565,-93.783519,"Jay Gilliam",adult,Sighting,Photograph,1,,,,,,,,,
344902,,,,"Bombus impatiens","Common Eastern Bumble Bee",Iowa,Polk,2023-09-10,,"Saylorville Visitor Center",41.710399,-93.67038,"Jay Gilliam",adult,Sighting,Photograph,1,,,,,,,,,
344903,,,,"Polistes parametricus","Parametric Paper Wasp",Iowa,Polk,2023-09-10,,"Saylorville Visitor Center",41.710399,-93.67038,"Jay Gilliam",adult,Sighting,Photograph,1,,,,,,,,,
344905,,,,"Ancistrocerus adiabatus",None,Iowa,Polk,2023-09-10,,"Saylorville Visitor Center",41.710399,-93.67038,"Jay Gilliam",adult,Sighting,Photograph,1,,,,,,,,,
344906,,,,"Bombus griseocollis","Brown-belted Bumble Bee",Iowa,Polk,2023-09-10,,"Saylorville Visitor Center",41.710399,-93.67038,"Jay Gilliam",adult,Sighting,Photograph,1,,,,,,,,,
344908,,,,"Xylocopa virginica","Eastern Carpenter Bee",Iowa,Polk,2023-09-10,,"Saylorville Visitor Center",41.710399,-93.67038,"Jay Gilliam",adult,Sighting,Photograph,1,,,,,,,,,
344909,,,,"Cerceris insolita",None,Iowa,Polk,2023-09-10,,"Saylorville Visitor Center",41.710399,-93.67038,"Jay Gilliam",adult,Sighting,Photograph,1,,,,,,,,,
344912,,,,"Myzinum quinquecinctum","Five-banded Tiphiid Wasp",Iowa,Polk,2023-09-10,,"Saylorville Visitor Center",41.710399,-93.67038,"Jay Gilliam",adult,Sighting,Photograph,1,,,,,,,,,
344913,,,,"Apis mellifera","Honey Bee",Iowa,Polk,2023-09-10,,"Saylorville Visitor Center",41.710399,-93.67038,"Jay Gilliam",adult,Sighting,Photograph,1,,,,,,,,,
344914,,,,"Eremnophila aureonotata",None,Iowa,Polk,2023-09-10,,"Saylorville Visitor Center",41.710399,-93.67038,"Jay Gilliam",adult,Sighting,Photograph,1,,,,,,,,,
344915,,,,"Agapostemon sericeus","Silky Striped-Sweat bee",Iowa,Polk,2023-09-10,,"Saylorville Visitor Center",41.710399,-93.67038,"Jay Gilliam",adult,Sighting,Photograph,1,,,,,,,,,
344920,,,,"Polistes fuscatus","Northern Paper Wasp",Iowa,Polk,2023-09-10,,"Dale Maffitt Reservoir",41.514565,-93.783519,"Jay Gilliam",adult,Sighting,Photograph,1,,,,,,,,,
345081,,,,"Schizocerella pilicornis",None,Iowa,Polk,2023-07-29,,"Jester Park",41.780904,-93.774207,"Mark Brown",adult,Sighting,Photograph,1,,,,,,,,,
345083,,,,"Parancistrocerus pedestris",None,Iowa,Polk,2023-07-29,,"Jester Park",41.780904,-93.774207,"Mark Brown",adult,Sighting,Photograph,1,,,,,,,,,
345247,,,,"Vespula maculifrons",None,Iowa,Polk,2023-07-29,09:03:19,"Jester Park",41.780774696667,-93.77080688,"Mark Brown",adult,Sighting,Photograph,1,,,,,,,,,
347246,,,,"Bombus impatiens","Common Eastern Bumble Bee",Iowa,Polk,2023-09-24,,"Chichaqua Bottoms- Clingan Grassland Unit",41.780303,-93.357945,"Jay Gilliam",adult,Sighting,Photograph,1,,,,,,,,,
347827,,,,"Eumenes fraternus","Fraternal Potter Wasp",Iowa,Polk,2023-08-12,09:44:00,"Saylorville Visitor Center",41.707308266667,-93.671161271667,"Mark Brown",adult,Sighting,Photograph,1,,,,,,,,,
347828,,,,"Xylocopa virginica","Eastern Carpenter Bee",Iowa,Polk,2023-08-12,10:03:08,"Saylorville Visitor Center",41.707308266667,-93.671161271667,"Mark Brown",adult,Sighting,Photograph,1,,,,,,,,,
348057,,,,"Triepeolus lunatus",None,Iowa,Polk,2023-08-12,,"Saylorville Visitor Center",41.707843,-93.670911,"Mark Brown",adult,Sighting,Photograph,1,,,,,,,,,
351900,,,,"Agapostemon virescens",None,Iowa,Polk,2013-07-03,,Urbandale,41.627585,-93.710466,"Dan Gibson",adult,,,1,,,,,,,,,"Data from Kirk Larsen, Luther College"
