ID,"Collection / Source","Catalog Number","Specify Number",Taxon,"Common Name",State,County,Date,Time,Locale,Latitude,Longitude,Collector,"Life Stage","Collection Method","Preparation Type",Count,Temperature,Humidity,"Dew Point",Wind,"Wind Direction","Barometric Pressure",Sky,"Moon Phase",Notes
2432,,2014-002713,,"Chlosyne nycteis","Silvery Checkerspot",Iowa,Polk,1950-06-15,,"Polk County",41.627842,-93.500343," USGS - NPWRC",adult,Sighting,Sighting,1,,,,,,,,,"HIstorical Record"
6641,,2014-006922,,"Chlosyne nycteis","Silvery Checkerspot",Iowa,Polk,2009-06-28,,"Chichaqua Bottoms Greenbelt",41.7958,-93.413,"Aaron Brees",adult,Sighting,Sighting,1,,,,,,,,,
52332,,2014-052714,,"Chlosyne nycteis","Silvery Checkerspot",Iowa,Polk,2005-06-12,,"Chichaqua Bottoms Sandhill Prairie",41.76717,-93.37483,"Frank Olsen",adult,Sighting,Sighting,1,,,,,,,,,
52333,,2014-052715,,"Chlosyne nycteis","Silvery Checkerspot",Iowa,Polk,2005-06-12,,"Chichaqua Bottoms Sandhill Prairie",41.76717,-93.37483,"Frank Olsen",adult,Sighting,Sighting,1,,,,,,,,,
52334,,2014-052716,,"Chlosyne nycteis","Silvery Checkerspot",Iowa,Polk,2005-08-10,,"Chichaqua Bottoms Sandhill Prairie",41.76717,-93.37483,"Frank Olsen",adult,Sighting,Sighting,1,,,,,,,,,
66085,,2014-066689,,"Chlosyne nycteis","Silvery Checkerspot",Iowa,Polk,2014-06-28,,"Big Creek State Park",41.807055,-93.745185,"Mark Brown",adult,Sighting,Photograph,1,,,,,,,,,
129308,,2015-019898,,"Chlosyne nycteis","Silvery Checkerspot",Iowa,Polk,2015-08-17,,"Big Creek State Park",41.807055,-93.745185,"Mark Brown",adult,Sighting,Sighting,1,,,,,,,,,
181877,,2016-046621,,"Chlosyne nycteis","Silvery Checkerspot",Iowa,Polk,2016-08-06,,"Big Creek State Park",41.807055,-93.745185,"Mark Brown",adult,Sighting,Photograph,1,,,,,,,,,
181943,,2016-046691,,"Chlosyne nycteis","Silvery Checkerspot",Iowa,Polk,2016-08-07,,"Big Creek State Park",41.807055,-93.745185,"Mark Brown",adult,Sighting,Photograph,1,,,,,,,,,
181944,,2016-046692,,"Chlosyne nycteis","Silvery Checkerspot",Iowa,Polk,2016-08-07,,"Big Creek State Park",41.807055,-93.745185,"Mark Brown",adult,Sighting,Photograph,1,,,,,,,,,
190625,,2017-008586,,"Chlosyne nycteis","Silvery Checkerspot",Iowa,Polk,2016-07-27,,"Big Creek State Park",41.801614,-93.753022,"IBSN ",adult,Sighting,Sighting,1,84,,,"Relatively Still",,,"Mostly Clear",,
190667,,2017-008628,,"Chlosyne nycteis","Silvery Checkerspot",Iowa,Polk,2016-08-01,,"Thomas Mitchell Park",41.64,-93.3823,"IBSN ",adult,Sighting,Sighting,2,86,,,"Moderately Windy",,,"Partly Cloudy",,"edge;prairie;upland forest;stream bank;prairie"
250879,,,,"Chlosyne nycteis","Silvery Checkerspot",Iowa,Polk,2018-06-24,15:00,"Big Creek State Park",41.802522,-93.733288,IBSN,adult,Sighting,Sighting,1,79,,,"Relatively Still",,,Overcast,,
250880,,,,"Chlosyne nycteis","Silvery Checkerspot",Iowa,Polk,2018-08-04,10:30,"Big Creek State Park",41.802522,-93.733288,IBSN,adult,Sighting,Sighting,1,79,,,"Moderately Windy",,,"Mostly Cloudy",,
250881,,,,"Chlosyne nycteis","Silvery Checkerspot",Iowa,Polk,2018-08-30,13:45,"Big Creek State Park",41.802522,-93.733288,IBSN,adult,Sighting,Sighting,1,72,,,"Moderately Windy",,,Overcast,,
250882,,,,"Chlosyne nycteis","Silvery Checkerspot",Iowa,Polk,2019-06-16,12:50,"Big Creek State Park",41.802522,-93.733288,IBSN,adult,Sighting,Sighting,1,73,,,"Relatively Still",,,"Mostly Cloudy",,
250883,,,,"Chlosyne nycteis","Silvery Checkerspot",Iowa,Polk,2019-06-29,16:40,"Big Creek State Park",41.802522,-93.733288,IBSN,adult,Sighting,Sighting,9,95,,,Calm,,,"Partly Cloudy",,
250884,,,,"Chlosyne nycteis","Silvery Checkerspot",Iowa,Polk,2019-07-03,14:10,"Big Creek State Park",41.802522,-93.733288,IBSN,adult,Sighting,Sighting,12,88,,,"Relatively Still",,,"Partly Cloudy",,
250885,,,,"Chlosyne nycteis","Silvery Checkerspot",Iowa,Polk,2019-07-03,14:10,"Big Creek State Park",41.802522,-93.733288,IBSN,adult,Sighting,Sighting,3,88,,,"Relatively Still",,,"Partly Cloudy",,
250886,,,,"Chlosyne nycteis","Silvery Checkerspot",Iowa,Polk,2019-07-03,14:10,"Big Creek State Park",41.802522,-93.733288,IBSN,adult,Sighting,Sighting,40,88,,,"Relatively Still",,,"Partly Cloudy",,
250887,,,,"Chlosyne nycteis","Silvery Checkerspot",Iowa,Polk,2019-08-09,14:40,"Big Creek State Park",41.802522,-93.733288,IBSN,adult,Sighting,Sighting,7,82,,,"Relatively Still",,,Clear,,
250911,,,,"Chlosyne nycteis","Silvery Checkerspot",Iowa,Polk,2017-08-01,13:53,"Red Feather Prairie",41.723743,-93.671574,IBSN,adult,Sighting,Sighting,1,29,,,"Relatively Still",,,"Partly Cloudy",,
250913,,,,"Chlosyne nycteis","Silvery Checkerspot",Iowa,Polk,2018-06-23,13:30,"Thomas Mitchell Park",41.64,-93.3823,IBSN,adult,Sighting,Sighting,1,77,,,"Relatively Still",,,"Partly Cloudy",,
250914,,,,"Chlosyne nycteis","Silvery Checkerspot",Iowa,Polk,2019-06-30,12:30,"Thomas Mitchell Park",41.64,-93.3823,IBSN,adult,Sighting,Sighting,2,91,,,"Relatively Still",,,"Mostly Cloudy",,
275501,,,,"Chlosyne nycteis","Silvery Checkerspot",Iowa,Polk,2019-08-16,,"Saylorville Visitor Center",41.710399,-93.67038,"Jay Gilliam",adult,Sighting,Photograph,1,,,,,,,,,
276154,,,,"Chlosyne nycteis","Silvery Checkerspot",Iowa,Polk,2020-08-01,,"Big Creek State Park",41.835251,-93.754627,"Jay Gilliam",adult,Sighting,Photograph,1,,,,,,,,,
280512,,,,"Chlosyne nycteis","Silvery Checkerspot",Iowa,Polk,2020-05-15,,"Oak Grove Park and Beach, Saylorville",41.737904,-93.69222985,"Chris Edwards",adult,Sighting,Sighting,1,,,,,,,,,
302989,,,,"Chlosyne nycteis","Silvery Checkerspot",Iowa,Polk,2021-07-30,10:45,"Jester Park",41.786297,-93.788656,IBSN,adult,Sighting,Sighting,3,73,,,,,,Hazy,,
302990,,,,"Chlosyne nycteis","Silvery Checkerspot",Iowa,Polk,2021-08-08,12:30,"Big Creek State Park",41.804681,-93.733121,IBSN,adult,Sighting,Sighting,2,73,,,,,,"Mostly Cloudy",,
342606,,,,"Chlosyne nycteis","Silvery Checkerspot",Iowa,Polk,2023-06-04,08:56:45,"Big Creek State Park",41.79303268,-93.734028325,"Mark Brown",adult,Sighting,Photograph,1,,,,,,,,,
363110,,,,"Chlosyne nycteis","Silvery Checkerspot",Iowa,Polk,2023-07-31,,"Jester Park",41.786753,-93.792568,IBSN,adult,Sighting,Sighting,1,,,,"Moderately Windy",,,"Mostly Clear",,
