ID,"Collection / Source","Catalog Number","Specify Number",Taxon,"Common Name",State,County,Date,Time,Locale,Latitude,Longitude,Collector,"Life Stage","Collection Method","Preparation Type",Count,Temperature,Humidity,"Dew Point",Wind,"Wind Direction","Barometric Pressure",Sky,"Moon Phase",Notes
185146,,2017-003108,,"Flygenus undetermined",None,Iowa,Scott,2016-07-30,,"Nahant Marsh Education Center",41.489953,-90.635216,"Moni Hayne",adult,,Photograph,1,,,,,,,,,
201849,,2017-019778,,"Euxesta notata",None,Iowa,Scott,2017-07-29,,"Nahant Marsh Education Center",41.489953,-90.635216,"Moni Hayne",adult,,Photograph,1,,,,,,,,,
230170,,2019-004883,,"Helophilus fasciatus",None,Iowa,Scott,2019-04-16,,"Nahant Marsh Education Center",41.489953,-90.635216,"Wolfgang Oesterreich",adult,,Photograph,1,,,,,,,,,
234984,,,,"Efferia aestuans",None,Iowa,Scott,2019-08-11,12:47:01,Bettendorf-x,41.52818333,-90.52517185,"Melissa Hawthorn",adult,Sighting,Photograph,1,,,,,,,,,
235084,,,,"Diogmites neoternatus",None,Iowa,Scott,2019-07-29,19:52:12,"Bettendorf, Ia-x",41.528919,-90.525665,"Amanda Morrison",adult,Sighting,Photograph,1,,,,,,,,,"Found in my yard in Bettendorf, Ia"
288518,,,,"Condylostylus sipho",None,Iowa,Scott,2021-06-18,7:15:48,Walcott,41.5818554,-90.7731075,"Weston Grove",adult,Sighting,Photograph,1,,,,,,,,,"Found in the house on the stove. Past few days they have been swarming around my chocolate lab in the backyard. "
338859,,,,"Diogmites neoternatus",None,Iowa,Scott,2023-08-01,21:01:49,"Along New Liberty Road-x",41.694156,-90.847936,"Ariel Sargent",adult,Sighting,Photograph,1,,,,,,,,,"Scott County"
341298,,,,"Chrysopilus thoracicus","Golden-backed Snipe Fly",Iowa,Scott,2022-06-18,15:04:00,Davenport,41.583638,-90.535055,"Gregory  Klauer",adult,Sighting,Photograph,1,,,,,,,,,
341302,,,,"Diogmites neoternatus",None,Iowa,Scott,2022-08-23,09:26,Davenport,41.58205,-90.542473,"Gregory  Klauer",adult,Sighting,Photograph,1,,,,,,,,,
