ID,"Collection / Source","Catalog Number","Specify Number",Taxon,"Common Name",State,County,Date,Time,Locale,Latitude,Longitude,Collector,"Life Stage","Collection Method","Preparation Type",Count,Temperature,Humidity,"Dew Point",Wind,"Wind Direction","Barometric Pressure",Sky,"Moon Phase",Notes
35734,"Jim Durbin Drawer 137",2014-036108,SPM013765,"Meganola spodia","Ashy Meganola Moth",Iowa,"Van Buren",2009-05-09,,"Lacey-Keosauqua State Park",40.71688,-91.9908,"Jim Durbin",adult,Blacklight/Fluorescent,Pinned,1,,,,,,,,,"Changed from Meganola minuscula 3/31/2019"
35755,,2014-036129,SPM033581,"Meganola spodia","Ashy Meganola Moth",Iowa,"Van Buren",2013-05-06,,"Shimek State Forest, Farmington Unit",40.6659,-91.73637,"Jim Durbin",adult,Blacklight/Fluorescent,Photograph,1,,,,,,,,,"Changed from Meganola minuscula 3/31/2019"
35756,,2014-036130,SPM033623,"Meganola spodia","Ashy Meganola Moth",Iowa,"Van Buren",2013-05-06,,"Shimek State Forest, Farmington Unit",40.6659,-91.73637,"Jim Durbin",adult,Blacklight/Fluorescent,Photograph,1,,,,,,,,,"Changed from Meganola minuscula 3/31/2019"
35760,"Jim Durbin Drawer 137",2014-036134,SPM008415,"Meganola spodia","Ashy Meganola Moth",Iowa,"Van Buren",2007-04-21,,"Lacey-Keosauqua State Park",40.71688,-91.9908,"Jim Durbin",adult,Blacklight/Fluorescent,Pinned,1,,,,,,,,,
35780,,2014-036154,SPM033585,"Meganola spodia","Ashy Meganola Moth",Iowa,"Van Buren",2013-05-06,,"Shimek State Forest, Farmington Unit",40.6659,-91.73637,"Jim Durbin",adult,Blacklight/Fluorescent,Photograph,1,,,,,,,,,
35781,,2014-036155,SPM033605,"Meganola spodia","Ashy Meganola Moth",Iowa,"Van Buren",2013-05-06,,"Shimek State Forest, Farmington Unit",40.6659,-91.73637,"Jim Durbin",adult,Blacklight/Fluorescent,Photograph,1,,,,,,,,,
35782,,2014-036156,SPM033610,"Meganola spodia","Ashy Meganola Moth",Iowa,"Van Buren",2013-05-06,,"Shimek State Forest, Farmington Unit",40.6659,-91.73637,"Jim Durbin",adult,Blacklight/Fluorescent,Photograph,1,,,,,,,,,
35783,,2014-036157,SPM033619,"Meganola spodia","Ashy Meganola Moth",Iowa,"Van Buren",2013-05-06,,"Shimek State Forest, Farmington Unit",40.6659,-91.73637,"Jim Durbin",adult,Blacklight/Fluorescent,Photograph,1,,,,,,,,,
35786,,2014-036160,SPM037935,"Meganola spodia","Ashy Meganola Moth",Iowa,"Van Buren",2013-05-14,,"Shimek State Forest, Farmington Unit",40.6659,-91.73637,"Frank Olsen",adult,,Photograph,1,,,,,,,,,
37958,,2014-038332,SPM035650,"Meganola spodia","Ashy Meganola Moth",Iowa,"Van Buren",2013-08-07,,"Shimek State Forest, Farmington Unit",40.6659,-91.73637,"Jim Durbin",adult,Blacklight/Fluorescent,Photograph,1,,,,,,,,,
