ID,"Collection / Source","Catalog Number","Specify Number",Taxon,"Common Name",State,County,Date,Time,Locale,Latitude,Longitude,Collector,"Life Stage","Collection Method","Preparation Type",Count,Temperature,Humidity,"Dew Point",Wind,"Wind Direction","Barometric Pressure",Sky,"Moon Phase",Notes
557,"Frank Olsen Drawer 10",2014-000557,SPM010934,"Apoda y-inversa","Yellow-collared Slug Moth",Iowa,"Van Buren",2004-07-18,,"Shimek State Forest, Farmington Unit",40.64802,-91.7254,"Frank Olsen",adult,,Pinned,1,,,,,,,,,"Located at Iowa State"
16111,"Frank Olsen Drawer 48",2014-016409,SPM024861,"Apoda biguttata","Shagreened Slug Moth",Iowa,"Van Buren",2011-07-20,,"Shimek State Forest, Farmington Unit",40.6659,-91.73637,"Frank Olsen",adult,,Pinned,1,,,,,,,,,"Located at Iowa State"
16123,"Jim Durbin Drawer 036",2014-016421,SPM007857,"Apoda y-inversa","Yellow-collared Slug Moth",Iowa,"Van Buren",2006-06-15,,"Shimek State Forest, Farmington Unit",40.64802,-91.7254,"Frank Olsen",adult,Blacklight/Florescent,Pinned,1,,,,,,,,,
16124,"Frank Olsen Drawer 10",2014-016422,SPM007858,"Apoda y-inversa","Yellow-collared Slug Moth",Iowa,"Van Buren",2006-06-15,,"Shimek State Forest, Farmington Unit",40.64802,-91.7254,"Frank Olsen",adult,,Pinned,1,,,,,,,,,"Located at Iowa State"
16125,"Frank Olsen Drawer 10",2014-016423,SPM007859,"Apoda y-inversa","Yellow-collared Slug Moth",Iowa,"Van Buren",2006-06-15,,"Shimek State Forest, Farmington Unit",40.64802,-91.7254,"Frank Olsen",adult,,Pinned,1,,,,,,,,,"Located at Iowa State"
16126,"Frank Olsen Drawer 10",2014-016424,SPM007860,"Apoda y-inversa","Yellow-collared Slug Moth",Iowa,"Van Buren",2006-06-15,,"Shimek State Forest, Farmington Unit",40.64802,-91.7254,"Frank Olsen",adult,,Pinned,1,,,,,,,,,"Located at Iowa State"
16173,"Frank Olsen Drawer 10",2014-016471,SPM031715,"Apoda y-inversa","Yellow-collared Slug Moth",Iowa,"Van Buren",2012-06-10,,"Shimek State Forest, Farmington Unit",40.6659,-91.73637,"Frank Olsen",adult,,Pinned,1,,,,,,,,,"Located at Iowa State"
26217,"Frank Olsen Drawer 48",2014-026565,SPM002726,"Euclea delphinii","Spiny Oak-slug Moth",Iowa,"Van Buren",2004-07-18,,"Shimek State Forest, Farmington Unit",40.64802,-91.7254,"Frank Olsen",adult,,Pinned,1,,,,,,,,,"Located at Iowa State"
32740,"Frank Olsen Drawer 48",2014-033112,SPM002958,"Isa textula","Crowned Slug Moth",Iowa,"Van Buren",2004-07-18,,"Shimek State Forest, Farmington Unit",40.64802,-91.7254,"Frank Olsen",adult,,Pinned,1,,,,,,,,,"Located at Iowa State"
32756,"Frank Olsen Drawer 48",2014-033128,SPM024862,"Isa textula","Crowned Slug Moth",Iowa,"Van Buren",2011-07-20,,"Shimek State Forest, Farmington Unit",40.6659,-91.73637,"Frank Olsen",adult,,Pinned,1,,,,,,,,,"Located at Iowa State"
32757,"Frank Olsen Drawer 48",2014-033129,SPM024863,"Isa textula","Crowned Slug Moth",Iowa,"Van Buren",2011-07-20,,"Shimek State Forest, Farmington Unit",40.6659,-91.73637,"Frank Olsen",adult,,Pinned,1,,,,,,,,,"Located at Iowa State"
34307,"Frank Olsen Drawer 45",2014-034680,SPM007807,"Lithacodes fasciola","Yellow-shouldered Slug Moth",Iowa,"Van Buren",2006-06-15,,"Shimek State Forest, Farmington Unit",40.64802,-91.7254,"Frank Olsen",adult,,Pinned,1,,,,,,,,,"Located at Iowa State"
34322,,2014-034695,SPM021770,"Lithacodes fasciola","Yellow-shouldered Slug Moth",Iowa,"Van Buren",2011-06-05,,"Shimek State Forest, Farmington Unit",40.6659,-91.73637,"Jim Durbin",adult,Blacklight/Fluorescent,Photograph,1,,,,,,,,,
34323,,2014-034696,SPM021771,"Lithacodes fasciola","Yellow-shouldered Slug Moth",Iowa,"Van Buren",2011-06-05,,"Shimek State Forest, Farmington Unit",40.6659,-91.73637,"Jim Durbin",adult,Blacklight/Fluorescent,Photograph,1,,,,,,,,,
34324,,2014-034697,SPM021772,"Lithacodes fasciola","Yellow-shouldered Slug Moth",Iowa,"Van Buren",2011-06-05,,"Shimek State Forest, Farmington Unit",40.6659,-91.73637,"Jim Durbin",adult,Blacklight/Fluorescent,Photograph,1,,,,,,,,,
34325,,2014-034698,SPM021773,"Lithacodes fasciola","Yellow-shouldered Slug Moth",Iowa,"Van Buren",2011-06-05,,"Shimek State Forest, Farmington Unit",40.6659,-91.73637,"Jim Durbin",adult,Blacklight/Fluorescent,Photograph,1,,,,,,,,,
39388,"Frank Olsen Drawer 45",2014-039762,SPM016009,"Packardia elegans","Elegant Tailed Slug Moth",Iowa,"Van Buren",2006-06-15,,"Shimek State Forest, Farmington Unit",40.64802,-91.7254,"Frank Olsen",adult,,Pinned,1,,,,,,,,,"Located at Iowa State"
41767,"Jim Durbin Drawer 036",2014-042144,SPM035521,"Phobetron pithecium","Hag [ Monkey Slug ] Moth",Iowa,"Van Buren",2013-08-07,,"Shimek State Forest, Farmington Unit",40.6659,-91.73637,"Jim Durbin",adult,Blacklight/Fluorescent,Pinned,1,,,,,,,,,
43452,"Frank Olsen Drawer 10",2014-043829,SPM024529,"Prolimacodes badia","Skiff Moth",Iowa,"Van Buren",2011-07-20,,"Shimek State Forest, Farmington Unit",40.6659,-91.73637,"Frank Olsen",adult,,Pinned,1,,,,,,,,,"Located at Iowa State"
43453,"Frank Olsen Drawer 10",2014-043830,SPM024530,"Prolimacodes badia","Skiff Moth",Iowa,"Van Buren",2011-07-20,,"Shimek State Forest, Farmington Unit",40.6659,-91.73637,"Frank Olsen",adult,,Pinned,1,,,,,,,,,"Located at Iowa State"
47962,,2014-048340,SPM035674,"Tortricidia flexuosa","Abbreviated Button Slug Moth",Iowa,"Van Buren",2013-08-07,,"Shimek State Forest, Farmington Unit",40.6659,-91.73637,"Jim Durbin",adult,Blacklight/Fluorescent,Photograph,1,,,,,,,,,
47971,"Jim Durbin Drawer 035",2014-048349,SPM021731,"Tortricidia testacea","Early Button Slug Moth",Iowa,"Van Buren",2011-06-05,,"Shimek State Forest, Farmington Unit",40.6659,-91.73637,"Jim Durbin",adult,Blacklight/Fluorescent,Pinned,1,,,,,,,,,
308785,"Jim Durbin Drawer 036",2022-000058,,"Phobetron pithecium","Hag [ Monkey Slug ] Moth",Iowa,"Van Buren",2004-07-31,,"Shimek State Forest, Farmington Unit",40.648052,-91.725546,"Ed Freese",adult,Blacklighting,Pinned,1,,,,,,,,,
309342,"Jim Durbin Drawer 036",2022-000594,,"Apoda y-inversa","Yellow-collared Slug Moth",Iowa,"Van Buren",2018-06-13,,"Shimek State Forest, Farmington Unit",40.665817,-91.736605,"Frank Olsen",adult,Blacklighting,Pinned,1,,,,,,,,,
