ID,"Collection / Source","Catalog Number","Specify Number",Taxon,"Common Name",State,County,Date,Time,Locale,Latitude,Longitude,Collector,"Life Stage","Collection Method","Preparation Type",Count,Temperature,Humidity,"Dew Point",Wind,"Wind Direction","Barometric Pressure",Sky,"Moon Phase",Notes
3129,,2014-003410,,"Euphyes bimacula","Two-spotted Skipper",Iowa,Warren,1950-07-01,,Redacted,Redacted,Redacted," USGS - NPWRC",adult,Sighting,Sighting,1,,,,,,,,,"HIstorical Record"
55250,,2014-055632,,"Euphyes bimacula","Two-spotted Skipper",Iowa,Warren,1968-07-12,,Redacted,Redacted,Redacted,"Ron Royer",adult,Sighting,Sighting,3,,,,,,,,,
131288,,2015-021879,,"Euphyes bimacula","Two-spotted Skipper",Iowa,Warren,2015-06-18,,Redacted,Redacted,Redacted,"Frank Olsen",adult,Sighting,Sighting,2,75,,,5,45,,"Mostly cloudy",,
280973,,,,"Euphyes bimacula","Two-spotted Skipper",Iowa,Warren,2020-07-02,,Redacted,Redacted,Redacted,"Chris Edwards",adult,Sighting,Sighting,1,,,,,,,,,
280974,,,,"Euphyes bimacula","Two-spotted Skipper",Iowa,Warren,2020-07-02,,Redacted,Redacted,Redacted,"Chris Edwards",adult,Sighting,Sighting,3,,,,,,,,,
288314,,,,"Euphyes bimacula","Two-spotted Skipper",Iowa,Warren,2021-06-16,11:17:54,Redacted,Redacted,Redacted,"Harlan Ratcliff",adult,Sighting,Photograph,1,,,,,,,,,"Rolling Thunder Prairie, on common milkweed."
296295,,,,"Euphyes bimacula","Two-spotted Skipper",Iowa,Warren,2021-06-27,6:39:25,Redacted,Redacted,Redacted,"Mark Brown",adult,Sighting,Photograph,1,,,,,,,,,
296301,,,,"Euphyes bimacula","Two-spotted Skipper",Iowa,Warren,2021-06-27,6:39:25,Redacted,Redacted,Redacted,"Mark Brown",adult,Sighting,Photograph,1,,,,,,,,,
300568,,,,"Euphyes bimacula","Two-spotted Skipper",Iowa,Warren,2021-06-18,,Redacted,Redacted,Redacted,"Jay Gilliam",adult,Sighting,Photograph,8,,,,,,,,,
318066,,,,"Euphyes bimacula","Two-spotted Skipper",Iowa,Warren,2022-06-26,,Redacted,Redacted,Redacted,"Jay Gilliam",adult,Sighting,Photograph,5,,,,,,,,,
