ID,"Collection / Source","Catalog Number","Specify Number",Taxon,"Common Name",State,County,Date,Time,Locale,Latitude,Longitude,Collector,"Life Stage","Collection Method","Preparation Type",Count,Temperature,Humidity,"Dew Point",Wind,"Wind Direction","Barometric Pressure",Sky,"Moon Phase",Notes
27781,"Jim Durbin Drawer 037",2014-028134,SPM023642,"Evergestis unimacula","Large-spotted Evergestis Moth",Iowa,Winneshiek,2011-08-26,,"100 Acre Wood-x",43.431848,-92.009353,"Jim Durbin",adult,Blacklight/Fluorescent,Pinned,1,,,,,,,,,
66745,,2014-067350,,"Evergestis unimacula","Large-spotted Evergestis Moth",Iowa,Winneshiek,2011-08-24,,"100 Acre Wood-x",0,0,"MJ Hatfield",adult,,Photograph,1,,,,,,,,,
66776,,2014-067381,,"Evergestis unimacula","Large-spotted Evergestis Moth",Iowa,Winneshiek,2011-08-23,,"100 Acre Wood-x",0,0,"MJ Hatfield",adult,,Photograph,1,,,,,,,,,
66874,,2014-067479,,"Evergestis unimacula","Large-spotted Evergestis Moth",Iowa,Winneshiek,2011-08-14,,"100 Acre Wood-x",0,0,"MJ Hatfield",adult,,Photograph,1,,,,,,,,,
67320,,2014-067925,,"Evergestis unimacula","Large-spotted Evergestis Moth",Iowa,Winneshiek,2012-07-02,,"100 Acre Wood-x",0,0,"MJ Hatfield",adult,,Photograph,1,,,,,,,,,
67426,,2014-068031,,"Evergestis unimacula","Large-spotted Evergestis Moth",Iowa,Winneshiek,2012-06-27,,"100 Acre Wood-x",0,0,"MJ Hatfield",adult,,Photograph,1,,,,,,,,,
355988,,,,"Evergestis unimacula","Large-spotted Evergestis Moth",Iowa,Winneshiek,2018-08-07,,"Hickory Ridge Woods",43.3178,-91.7959,"Lena Schmitt",adult,,,1,,,,,,,,,"Data from Kirk Larsen, Luther College"
355989,,,,"Evergestis unimacula","Large-spotted Evergestis Moth",Iowa,Winneshiek,2018-06-24,,"Hickory Ridge Woods",43.3178,-91.7959,"Lena Schmitt",adult,,,1,,,,,,,,,"Data from Kirk Larsen, Luther College"
358676,,,,"Evergestis unimacula","Large-spotted Evergestis Moth",Iowa,Winneshiek,2018-06-24,,"Roslien Woods",43.3244,-91.8216,"Lena Schmitt",adult,,,1,,,,,,,,,"Data from Kirk Larsen, Luther College"
