ID,"Collection / Source","Catalog Number","Specify Number",Taxon,"Common Name",State,County,Date,Time,Locale,Latitude,Longitude,Collector,"Life Stage","Collection Method","Preparation Type",Count,Temperature,Humidity,"Dew Point",Wind,"Wind Direction","Barometric Pressure",Sky,"Moon Phase",Notes
276446,,2020-000794,,"Sympetrum vicinum","Autumn Meadowhawk",Iowa,Wright,2020-09-19,,"Big Wall Lake Wildlife Management Area",42.626904,-93.651943,"Jay Gilliam",adult,Sighting,Photograph,1,,,,,,,,,521
276462,,2020-000810,,"Sympetrum vicinum","Autumn Meadowhawk",Iowa,Wright,2020-09-26,,"Big Wall Lake Wildlife Management Area",42.626904,-93.651943,"Jay Gilliam",adult,Sighting,Photograph,2,,,,,,,,,1043
276506,,2020-000854,,"Sympetrum vicinum","Autumn Meadowhawk",Iowa,Wright,2020-10-11,,"Big Wall Lake Wildlife Management Area",42.626904,-93.651943,"Jay Gilliam",adult,Sighting,Photograph,26,,,,,,,,,2024
294635,"Odonate Central",,,"Sympetrum vicinum","Autumn Meadowhawk",Iowa,Wright,2020-09-19,,"Big Wall Lake Wildlife Management Area",42.623672,-93.649438,"Jay Gilliam",adult,Sighting,Photo,1,,,,,,,,,
294654,"Odonate Central",,,"Sympetrum vicinum","Autumn Meadowhawk",Iowa,Wright,2020-09-26,,"Big Wall Lake Wildlife Management Area",42.623672,-93.649438,"Jay Gilliam",adult,Sighting,Photo,1,,,,,,,,,
294688,"Odonate Central",,,"Sympetrum vicinum","Autumn Meadowhawk",Iowa,Wright,2020-10-11,,"Big Wall Lake Wildlife Management Area",42.623672,-93.649438,"Jay Gilliam",adult,Sighting,"Observed Only",1,,,,,,,,,
302194,,,,"Sympetrum vicinum","Autumn Meadowhawk",Iowa,Wright,2021-09-11,,"Big Wall Lake Wildlife Management Area",42.626904,-93.651943,"Jay Gilliam",adult,Sighting,Sighting,1,,,,,,,,,
302227,,,,"Sympetrum vicinum","Autumn Meadowhawk",Iowa,Wright,2021-09-26,,"Big Wall Lake Wildlife Management Area",42.626904,-93.651943,"Jay Gilliam",adult,Sighting,Photograph,30,,,,,,,,,
302247,,,,"Sympetrum vicinum","Autumn Meadowhawk",Iowa,Wright,2021-10-03,,"Big Wall Lake Wildlife Management Area",42.626904,-93.651943,"Jay Gilliam",adult,Sighting,Sighting,30,,,,,,,,,
302251,,,,"Sympetrum vicinum","Autumn Meadowhawk",Iowa,Wright,2021-10-09,,"Big Wall Lake Wildlife Management Area",42.626904,-93.651943,"Jay Gilliam",adult,Sighting,Sighting,30,,,,,,,,,
319498,,,,"Sympetrum vicinum","Autumn Meadowhawk",Iowa,Wright,2022-09-18,,"Big Wall Lake Wildlife Management Area",42.626904,-93.651943,"Jay Gilliam",adult,Sighting,Sighting,3,,,,,,,,,
319518,,,,"Sympetrum vicinum","Autumn Meadowhawk",Iowa,Wright,2022-10-02,,"Big Wall Lake Wildlife Management Area",42.626904,-93.651943,"Jay Gilliam",adult,Sighting,Photograph,15,,,,,,,,,
319534,,,,"Sympetrum vicinum","Autumn Meadowhawk",Iowa,Wright,2022-10-09,,"Big Wall Lake Wildlife Management Area",42.626904,-93.651943,"Jay Gilliam",adult,Sighting,Photograph,40,,,,,,,,,
345571,,,,"Sympetrum vicinum","Autumn Meadowhawk",Iowa,Wright,2023-09-24,,"Big Wall Lake Wildlife Management Area",42.626904,-93.651943,"Jay Gilliam",adult,Sighting,Photograph,2,,,,,,,,,6443
