ID,"Collection / Source","Catalog Number","Specify Number",Taxon,"Common Name",State,County,Date,Time,Locale,Latitude,Longitude,Collector,"Life Stage","Collection Method","Preparation Type",Count,Temperature,Humidity,"Dew Point",Wind,"Wind Direction","Barometric Pressure",Sky,"Moon Phase",Notes
10890,"Jim Durbin Drawer 312-08",2014-011172,SPM006158,"Tomarus gibbosus",None,Kentucky,Ohio,2006-05-29,,"Leon's Farm, Ohio County",37.42033,-86.77023,"Jim Durbin",adult,Blacklight/Fluorescent,Pinned,1,,,,,,,,,
18687,"Jim Durbin Drawer 312-08",2014-019010,SPM018721,"Tomarus gibbosus",None,Iowa,Fremont,2010-08-05,,"Waubonsie State Park",40.676,-95.689,"Jim Durbin",adult,Blacklight,Pinned,1,,,,,,,,,
42115,"Jim Durbin Drawer 312-08",2014-042492,SPM004347,"Tomarus gibbosus",None,Kentucky,Ohio,2005-06-06,,"Leon's Farm, Ohio County",37.42033,-86.77023,"Jim Durbin",adult,Blacklight/Fluorescent,Pinned,1,,,,,,,,,
42116,"Jim Durbin Drawer 312-08",2014-042493,SPM004348,"Tomarus gibbosus",None,Kentucky,Ohio,2005-06-06,,"Leon's Farm, Ohio County",37.42033,-86.77023,"Jim Durbin",adult,Blacklight/Fluorescent,Pinned,1,,,,,,,,,
42117,"Jim Durbin Drawer 312-08",2014-042494,SPM004349,"Tomarus gibbosus",None,Kentucky,Ohio,2005-06-06,,"Leon's Farm, Ohio County",37.42033,-86.77023,"Jim Durbin",adult,Blacklight/Fluorescent,Pinned,1,,,,,,,,,
42120,"Jim Durbin Drawer 312-08",2014-042497,SPM006040,"Tomarus gibbosus",None,Kentucky,Ohio,2006-05-29,,"Leon's Farm, Ohio County",37.42033,-86.77023,"Jim Durbin",adult,Blacklight/Fluorescent,Pinned,1,,,,,,,,,
45067,"Jim Durbin Drawer 312-08",2014-045444,SPM001364,"Tomarus gibbosus",None,Iowa,Linn,2004-07-31,,"Behren's Pond Woodland State Preserve",42.118214,-91.754324,"Jim Durbin",adult,Blacklight,Pinned,1,,,,,,,,,
45071,"Jim Durbin Drawer 312-08",2014-045448,SPM004148,"Tomarus gibbosus",None,Iowa,Linn,2005-05-30,,"Wickiup Hill Outdoor Learning Area",42.08398,-91.7651,"Jim Durbin",adult,Blacklight/Fluorescent,Pinned,1,,,,,,,,,
45078,"Jim Durbin Drawer 312-08",2014-045455,SPM006610,"Tomarus gibbosus",None,Iowa,Linn,2006-06-15,,"Wanatee County Park",42.0094,-91.56623,"Jim Durbin",adult,Blacklight/Fluorescent,Pinned,1,,,,,,,,,
47930,"Jim Durbin Drawer 312-08",2014-048308,SPM001167,"Tomarus gibbosus",None,Iowa,Linn,2004-04-28,,"Wickiup Hill Outdoor Learning Area",42.08398,-91.7651,"Jim Durbin",adult,Blacklight,Pinned,1,,,,,,,,,
137795,,2016-002339,,"Tomarus gibbosus",None,Iowa,Johnson,2011-09-01,,"Iowa City",41.667,-91.545,"Mark Brown",adult,,Photograph,1,,,,,,,,,
220125,,2018-018281,,"Tomarus gibbosus",None,Iowa,Linn,2018-09-11,1945-2300,"Hitaga Sand Ridge Prairie Preserve",42.25095,-91.63209,"Jim Durbin",adult,Blacklight/Fluorescent,Photograph,1,73,64,60,2,110,30.02,clear,dark,
229525,,2019-004238,,"Tomarus gibbosus",None,Iowa,Jefferson,2018-04-13,,"Near Fairfield",41.0503,-92.024,"Moni Hayne",adult,,Photograph,1,,,,,,,,,
246160,,,,"Tomarus gibbosus",None,Iowa,Linn,2019-09-30,19:11:28,"Hitaga Sand Ridge Prairie Preserve",42.25088,-91.632179,"Jim Durbin",adult,Blacklight/Fluorescent,Photograph,1,,,,,,,,,
247290,,,,"Tomarus gibbosus",None,Iowa,Johnson,2019-09-15,16:41:19,"MacBride Nature Recreation Area",41.785643,-91.560496,"Mark Brown",adult,Sighting,Photograph,1,,,,,,,,,
264582,,,,"Tomarus gibbosus",None,Iowa,Linn,2020-05-15,,"Hitaga Sand Ridge Prairie Preserve",42.250881,-91.632144,"Jim Durbin",adult,Blacklight/Fluorescent,Photograph,1,60,85,56,0,0,30.01,clear,"50% visible",
273054,"Paul Martsching Collection",2020-000629,,"Tomarus gibbosus",None,Iowa,Story,2020-09-05,,"Ames, Paul",42.016779,-93.616948,"Paul Martsching",adult,"Building Light",Pinned,1,,,,,,,,,
286903,,,,"Tomarus gibbosus",None,Iowa,Jefferson,2020-07-22,21:54:10,"Near Fairfield",41.05009748,-92.02398156,"Moni Hayne",adult,Blacklight/Fluorescent,Photograph,1,,,,,,,,,
309598,,,,"Tomarus gibbosus",None,Iowa,Linn,2022-05-19,20:10:49,"Hitaga Sand Ridge Prairie Preserve",42.2510715,-91.63218361,"Jim Durbin",adult,Blacklight/Fluorescent,Photograph,10,81,50,61,20,180,29.32,cloudy,"full moon",
321608,"Paul Martsching Collection 1",2023-000058,,"Tomarus gibbosus",None,Iowa,Story,2022-09-20,,"Ames, Paul",42.011954,-93.615226,"Paul Martsching",adult,Sighting,Pinned,1,,,,,,,,,
352065,,,,"Tomarus gibbosus",None,Iowa,Story,1960-05-17,,Ames,42.013474,-93.601559,"L. F. Small",adult,,,1,,,,,,,,,"Data from Kirk Larsen, Luther College"
366906,,,,"Ligyrus gibbosus",None,Iowa,Linn,2024-06-13,20:18:49,"Palisades Kepler State Park",41.908442985,-91.502353318333,"Jim Durbin",adult,Blacklight/Fluorescent,Photograph,1,79,42,54,6,0,29.88,clear,"40 % visible",
367058,,,,"Tomarus gibbosus",None,Iowa,Linn,2024-06-13,21:52:41,"Palisades Kepler State Park",41.908442985,-91.502353318333,"Jim Durbin",adult,Blacklight/Fluorescent,Photograph,1,79,42,54,6,0,29.88,clear,"40 % visible",
