ID,"Collection / Source","Catalog Number","Specify Number",Taxon,"Common Name",State,County,Date,Time,Locale,Latitude,Longitude,Collector,"Life Stage","Collection Method","Preparation Type",Count,Temperature,Humidity,"Dew Point",Wind,"Wind Direction","Barometric Pressure",Sky,"Moon Phase",Notes
18731,,2014-019054,SPM033987,"Dichelonyx linearis",None,Iowa,Linn,2013-05-27,,"Matsell Bridge Natural Area",42.13131,-91.38886,"Jim Durbin",adult,Blacklight/Fluorescent,Photograph,1,,,,,,,,,
23578,"Jim Durbin Drawer 311-09",2014-023924,SPM001247,"Dichelonyx subvittata",None,Iowa,Linn,2004-06-12,,"Pleasant Creek State Recreation Area, Linn County",42.11952,-91.81215,"Jim Durbin",adult,Blacklight,Pinned,1,,,,,,,,,
23579,"Jim Durbin Drawer 311-09",2014-023925,SPM001414,"Dichelonyx subvittata",None,Iowa,Linn,2004-06-04,,"Wanatee County Park",42.0094,-91.56623,"Jim Durbin",adult,Blacklight,Pinned,1,,,,,,,,,
45083,"Jim Durbin Drawer 311-09",2014-045460,SPM017517,"Dichelonyx subvittata",None,Iowa,Linn,2010-05-22,,"Wanatee County Park",42.01026,-91.57381,"Jim Durbin",adult,Blacklight,Pinned,1,,,,,,,,,
45084,"Jim Durbin Drawer 311-09",2014-045461,SPM017725,"Dichelonyx subvittata",None,Iowa,Jones,2010-05-28,,"Wapsipinicon State Park",42.09038,-91.2861,"Jim Durbin",adult,Blacklight,Pinned,1,,,,,,,,,
126159,,2015-016727,,"Dichelonyx linearis",None,Iowa,Lee,2015-06-03,,"Shimek State Forest, Donnellson Unit",40.645189,-91.674665,"Jim Durbin",adult,Blacklight/Fluorescent,Photograph,1,,,,,,,,,
126168,,2015-016736,,"Dichelonyx linearis",None,Iowa,Lee,2015-06-03,,"Shimek State Forest, Donnellson Unit",40.645189,-91.674665,"Jim Durbin",adult,Blacklight/Fluorescent,Photograph,1,,,,,,,,,
128536,,2015-019126,,"Dichelonyx linearis",None,Iowa,Linn,2015-07-26,"2100 to 2300","Matsell Bridge Natural Area",42.131959,-91.388307,"Jim Durbin",adult,Blacklight/Fluorescent,Photograph,1,75,95,73,2,160,29.92,"partly cloudy","60% visible",
147142,,2016-011769,,"Dichelonyx subvittata",None,Iowa,Winneshiek,2010-05-23,,"Plymouth Rock-x",0,0,"MJ Hatfield",adult,,Photograph,1,,,,,,,,,
167201,,2016-031946,,"Dichelonyx linearis",None,Iowa,Linn,2016-05-23,2030-2300,"Matsell Bridge Natural Area",42.131126,-91.388999,"Jim Durbin",adult,Blacklight/Florescent,Photograph,1,74,42,50,7,130,29.82,clear,Full,
167892,,2016-032637,,"Dichelonyx linearis",None,Iowa,Linn,2016-05-29,2030-2300,"Vecny Woods",41.956725,-91.600854,"Jim Durbin",adult,Blacklight/Fluorescent,Photograph,1,76,54,58,0,180,29.94,"partly cloudy","80% visible","Very damp with short shower."
168745,,2016-033490,,"Dichelonyx linearis",None,Iowa,Linn,2016-06-05,2045-2300,"Vecny Woods",41.956725,-91.600854,"Jim Durbin",adult,Blacklight/Fluorescent,Photograph,1,80,36,51,4,300,29.67,"partly cloudy","dark phase",
169150,,2016-033895,,"Dichelonyx linearis",None,Iowa,Linn,2016-06-08,2048-2300,"Hitaga Sand Ridge Prairie Preserve",42.250957,-91.632098,"Jim Durbin",adult,Blacklight/Fluorescent,Photograph,1,75,48,53,0,120,29.88,cloudy,"10% visible",
169249,,2016-033994,,"Dichelonyx linearis",None,Iowa,Linn,2016-06-11,2100-2315,"Vecny Woods",41.956725,-91.600854,"Jim Durbin",adult,Blacklight/Fluorescent,Photograph,1,84,67,72,0,0,29.92,cloudy,"45% visible",
169386,,2016-034131,,"Dichelonyx linearis",None,Iowa,Linn,2016-06-15,2100-2315,"Hitaga Sand Ridge Prairie Preserve",42.250957,-91.632098,"Jim Durbin",adult,Blacklight/Fluorescent,Photograph,1,83,56,66,8,310,29.74,clear,"90% visible",
170916,,2016-035661,,"Dichelonyx linearis",None,Iowa,Linn,2016-06-24,2045-2300,"Wanatee County Park",42.01026,-91.57381,"Jim Durbin",adult,Blacklight/Fluorescent,Photograph,1,77,69,66,3,100,29.95,clear,"45 % visible","45 % visible"
193543,,2017-011533,,"Dichelonyx linearis",None,Iowa,Webster,2014-06-07,,"Dolliver Memorial State Park",42.3893,-94.0805,"Mark Brown",adult,,Photograph,1,,,,,,,,,
197129,,2017-015061,,"Dichelonyx linearis",None,Iowa,Webster,2014-06-07,,"Dolliver Memorial State Park",42.3893,-94.0805,"Mark Brown",adult,,Photograph,1,,,,,,,,,
211907,,2018-010064,,"Dichelonyx subvittata",None,Iowa,Linn,2018-06-06,2030-2315,"Wickiup Hill Outdoor Learning Area",42.087352,-91.767107,"Jim Durbin",adult,Blacklight/Fluorescent,Photograph,1,74,69,64,5,280,29.83,cloudy,"50% visible",
212032,,2018-010189,,"Dichelonyx linearis",None,Iowa,Linn,2018-06-11,2100-2300,"Hitaga Sand Ridge Prairie Preserve",42.250957,-91.632098,"Jim Durbin",adult,Blacklight/Fluorescent,Photograph,1,68,84,63,7,90,29.89,cloudy,"10% visible",
215275,,2018-013431,,"Dichelonyx subvittata",None,Iowa,Winneshiek,2018-05-29,,"100 Acre Wood-x",0,0,"MJ Hatfield",adult,"Blacklight Trap",Photograph,1,,,,,,,,,
215281,,2018-013437,,"Dichelonyx subvittata",None,Iowa,Winneshiek,2018-05-29,,"100 Acre Wood-x",0,0,"MJ Hatfield",adult,"Blacklight Trap",Photograph,1,,,,,,,,,
215332,,2018-013488,,"Dichelonyx subvittata",None,Iowa,Winneshiek,2018-05-31,,"100 Acre Wood-x",0,0,"MJ Hatfield",adult,"Blacklight Trap",Photograph,1,,,,,,,,,
215389,,2018-013545,,"Dichelonyx subvittata",None,Iowa,Winneshiek,2018-06-01,,"100 Acre Wood-x",0,0,"MJ Hatfield",adult,"Blacklight Trap",Photograph,1,,,,,,,,,
215412,,2018-013568,,"Dichelonyx subvittata",None,Iowa,Winneshiek,2018-06-01,,"100 Acre Wood-x",0,0,"MJ Hatfield",adult,"Blacklight Trap",Photograph,1,,,,,,,,,
215722,,2018-013878,,"Dichelonyx subvittata",None,Iowa,Winneshiek,2018-06-05,,"100 Acre Wood-x",0,0,"MJ Hatfield",adult,"Blacklight Trap",Photograph,1,,,,,,,,,
231691,,2019-006404,,"Dichelonyx linearis",None,Iowa,Linn,2019-06-14,,"Wickiup Hill Outdoor Learning Area",42.087352,-91.767107,"Jim Durbin",adult,Blacklight/Fluorescent,Photograph,1,68,64,55,5,170,29.64,cloudy,"10% visible",
231720,,2019-006433,,"Dichelonyx linearis",None,Iowa,Linn,2019-06-14,,"Wickiup Hill Outdoor Learning Area",42.087352,-91.767107,"Jim Durbin",adult,Blacklight/Fluorescent,Photograph,1,68,64,55,5,170,29.64,cloudy,"10% visible",
231850,,2019-006563,,"Dichelonyx linearis",None,Iowa,Linn,2019-06-14,,"Wickiup Hill Outdoor Learning Area",42.087352,-91.767107,"Jim Durbin",adult,Blacklight/Fluorescent,Photograph,1,68,64,55,5,170,29.64,cloudy,"10% visible",
289017,,,,"Dichelonyx subvittata",None,Iowa,Linn,2021-06-18,21:46:44,"Hitaga Sand Ridge Prairie Preserve",42.25091805,-91.63221484,"Jim Durbin",adult,Blacklight/Fluorescent,Photograph,1,84,46,61,4,180,29.75,"partly cloudy","50% visible",
290133,,,,"Dichelonyx linearis",None,Iowa,Linn,2021-07-03,21:03:16,"Pinicon Ridge Park",42.21096962,-91.54429747,"Jim Durbin",adult,Blacklight/Fluorescent,Pinned,1,79,57,63,3,190,29.9,clear,"50% visible",
296219,,,,"Dichelonyx linearis",None,Iowa,Johnson,2021-06-18,6:39:25,Redacted,Redacted,Redacted,"Mark Brown",adult,Sighting,Photograph,1,,,,,,,,,
310183,,,,"Dichelonyx subvittata",None,Iowa,Linn,2022-06-12,20:28:58,"Pinicon Ridge Park",42.21093766,-91.54432936,"Jim Durbin",adult,Sighting,Photograph,1,79,78,70,0,0,29.85,clear,full,
310215,,,,"Dichelonyx linearis",None,Iowa,Linn,2022-06-12,20:03:44,"Pinicon Ridge Park",42.21093766,-91.54432936,"Jim Durbin",adult,Sighting,Photograph,1,79,78,70,0,0,29.85,clear,full,
310218,,,,"Dichelonyx linearis",None,Iowa,Linn,2022-06-12,20:03:09,"Pinicon Ridge Park",42.21093766,-91.54432936,"Jim Durbin",adult,Sighting,Photograph,1,79,78,70,0,0,29.85,clear,full,
310424,,,,"Dichelonyx subvittata",None,Iowa,Linn,2022-06-16,22:28:20,"Wanatee County Park",42.01007932,-91.56651807,"Jim Durbin",adult,Blacklight/Fluorescent,Photograph,1,77,50,57,8,270,29.96,clear,full,
310430,,,,"Dichelonyx subvittata",None,Iowa,Linn,2022-06-16,22:26:58,"Wanatee County Park",42.01007932,-91.56651807,"Jim Durbin",adult,Blacklight/Fluorescent,Photograph,1,77,50,57,8,270,29.96,clear,full,
352832,,,,"Dichelonyx subvittata",None,Iowa,Winneshiek,2009-06-10,,"Anderson Prairie, Decorah",43.315099,-91.800701,"Reese Worthington",adult,,,1,,,,,,,,,"Data from Kirk Larsen, Luther College"
353456,,,,"Dichelonyx subvittata",None,Michigan,Kalkaska,1905-06-04,,"Big Twin Lake",44.82285,-84.9551,"Kirk J. Larsen",adult,,,1,,,,,,,,,"Data from Kirk Larsen, Luther College"
354289,,,,"Dichelonyx subvittata",None,Iowa,Winneshiek,1998-06-02,,"Coon Creek Wildlife Management Area",43.322222,-91.643056,"David Wente",adult,,,1,,,,,,,,,"Data from Kirk Larsen, Luther College"
354610,,,,"Dichelonyx subvittata",None,Iowa,Winneshiek,1997-06-16,,Decorah-x,43.30333,-91.78556,"Kirk J. Larsen",adult,,,1,,,,,,,,,"Data from Kirk Larsen, Luther College"
355960,,,,"Dichelonyx subvittata",None,Iowa,Winneshiek,1995-06-19,,"Hickory Ridge Woods",43.3178,-91.7959,"Lea F Schweitz",adult,,,1,,,,,,,,,"Data from Kirk Larsen, Luther College"
355961,,,,"Dichelonyx subvittata",None,Iowa,Winneshiek,1995-06-19,,"Hickory Ridge Woods",43.3178,-91.7959,"Lea F Schweitz",adult,,,1,,,,,,,,,"Data from Kirk Larsen, Luther College"
355962,,,,"Dichelonyx subvittata",None,Iowa,Winneshiek,2009-06-12,,"Hickory Ridge Woods",43.3178,-91.7959,"Reese Worthington",adult,,,1,,,,,,,,,"Data from Kirk Larsen, Luther College"
355963,,,,"Dichelonyx subvittata",None,Iowa,Winneshiek,2009-06-12,,"Hickory Ridge Woods",43.3178,-91.7959,"Reese Worthington",adult,,,1,,,,,,,,,"Data from Kirk Larsen, Luther College"
356599,,,,"Dichelonyx linearis",None,Iowa,Winneshiek,2009-06-24,,"Lake Meyer Park",43.17459,-91.90446,"Reese Worthington",adult,,,1,,,,,,,,,"Data from Kirk Larsen, Luther College"
356600,,,,"Dichelonyx subvittata",None,Iowa,Winneshiek,2009-06-24,,"Lake Meyer Park",43.17459,-91.90446,"Reese Worthington",adult,,,1,,,,,,,,,"Data from Kirk Larsen, Luther College"
356601,,,,"Dichelonyx subvittata",None,Iowa,Winneshiek,2009-06-24,,"Lake Meyer Park",43.17459,-91.90446,"Reese Worthington",adult,,,1,,,,,,,,,"Data from Kirk Larsen, Luther College"
356896,,,,"Dichelonyx subvittata",None,Iowa,Winneshiek,2009-06-23,,"Lionberger Environmental Preserve",43.334148,-91.871215,"Reese Worthington",adult,,,1,,,,,,,,,"Data from Kirk Larsen, Luther College"
356897,,,,"Dichelonyx subvittata",None,Iowa,Winneshiek,2009-06-23,,"Lionberger Environmental Preserve",43.334148,-91.871215,"Reese Worthington",adult,,,1,,,,,,,,,"Data from Kirk Larsen, Luther College"
357510,,,,"Dichelonyx subvittata",None,Iowa,Winneshiek,2009-06-10,,"Luther College",43.313333,-91.803889,"Reese Worthington",adult,,,1,,,,,,,,,"Data from Kirk Larsen, Luther College"
357841,,,,"Dichelonyx subvittata",None,Iowa,Winneshiek,2009-06-10,,"Malanaphy Springs",43.3453,-91.8417,"Reese Worthington",adult,,,1,,,,,,,,,"Data from Kirk Larsen, Luther College"
357842,,,,"Dichelonyx subvittata",None,Iowa,Winneshiek,2009-06-10,,"Malanaphy Springs",43.3453,-91.8417,"Reese Worthington",adult,,,1,,,,,,,,,"Data from Kirk Larsen, Luther College"
366633,,,,"Dichelonyx subvittata",None,Iowa,Linn,2024-06-01,20:51:32,"Pinicon Ridge Park",42.218536666667,-91.538833333333,"Jim Durbin",adult,Blacklight/Fluorescent,Photograph,1,68,83,61,,,29*.88,clear,"40 % visible",
366635,,,,"Dichelonyx subvittata",None,Iowa,Linn,2024-06-01,20:52:11,"Pinicon Ridge Park",42.218536666667,-91.538833333333,"Jim Durbin",adult,Blacklight/Fluorescent,Photograph,1,68,83,61,,,29*.88,clear,"40 % visible",
366641,,,,"Dichelonyx subvittata",None,Iowa,Linn,2024-06-01,21:15:31,"Pinicon Ridge Park",42.21854,-91.538841666667,"Jim Durbin",adult,Blacklight/Fluorescent,Photograph,1,68,83,61,,,29*.88,clear,"40 % visible",
367231,,,,"Dichelonyx subvittata",None,Iowa,Linn,2024-06-15,21:44:18,"Hitaga Sand Ridge Prairie Preserve",42.250848798333,-91.632148993333,"Jim Durbin",adult,Blacklight/Fluorescent,Photograph,1,79,50,59,12,170,29.86,"partly cloudy","50% visible",
