ID,"Collection / Source","Catalog Number","Specify Number",Taxon,"Common Name",State,County,Date,Time,Locale,Latitude,Longitude,Collector,"Life Stage","Collection Method","Preparation Type",Count,Temperature,Humidity,"Dew Point",Wind,"Wind Direction","Barometric Pressure",Sky,"Moon Phase",Notes
28615,,2014-028968,SPM017365,"Grapholita delineana","Delineated Grapholita Moth",Iowa,Muscatine,2010-04-26,,"Red Cedar Wildlife Area",41.4581,-91.2686,"Ryan Rasmussen",adult,,Photograph,1,,,,,,,,,
28616,,2014-028969,SPM021506,"Grapholita delineana","Delineated Grapholita Moth",Iowa,Jefferson,2010-05-30,,"Near Fairfield",41.0503,-92.024,"Moni Hayne",adult,Blacklight/Fluorescent,Photograph,1,,,,,,,,,
28618,,2014-028971,SPM017178,"Grapholita fana",None,Iowa,Winneshiek,2008-05-11,,"Plymouth Rock-x",0,0,"MJ Hatfield",adult,,Pinned,1,,,,,,,,,
28619,,2014-028972,SPM017466,"Grapholita fana",None,Iowa,Story,2009-07-29,,"2505 Tullamore Lane, Ames",42.088653,-93.578813,"MJ Hatfield",adult,,Photograph,1,,,,,,,,,
28620,,2014-028973,SPM023939,"Grapholita fana",None,Iowa,Winneshiek,2010-06-26,,"Plymouth Rock-x",0,0,"MJ Hatfield",adult,,Photograph,1,,,,,,,,,
28621,,2014-028974,SPM025618,"Grapholita fana",None,Iowa,Winneshiek,2011-05-30,,"Plymouth Rock-x",0,0,"MJ Hatfield",adult,,Photograph,1,,,,,,,,,
28622,,2014-028975,SPM025619,"Grapholita fana",None,Iowa,Story,2009-06-27,,"2505 Tullamore Lane, Ames",42.088653,-93.578813,"MJ Hatfield",adult,,Photograph,1,,,,,,,,,
28623,,2014-028976,SPM029046,"Grapholita fana",None,Iowa,Guthrie,2012-06-08,,"Whiterock Conservancy",41.80725,-94.64085,"Jim Durbin",adult,Blacklight/Fluorescent,Photograph,1,,,,,,,,,
28624,,2014-028977,SPM003457,"Grapholita interstinctana","Clover Head Caterpillar Moth",Iowa,Jasper,2003-05-15,,"Neal Smith National Wildlife Refuge",41.5678,-93.2675,"Keith Summerville",adult,,Pinned,1,,,,,,,,,
28625,,2014-028978,SPM023940,"Grapholita interstinctana","Clover Head Caterpillar Moth",Iowa,Dallas,2011-08-26,,"Adel - Prairie Seed Production Plots",41.658682,-94.030508,"Harlan Ratcliff",adult,,Photograph,1,,,,,,,,,
28626,,2014-028979,SPM033568,"Grapholita interstinctana","Clover Head Caterpillar Moth",Iowa,Muscatine,2010-06-03,,"Griner Preserve",41.5176,-91.07542,"Ryan Rasmussen",adult,,Photograph,1,,,,,,,,,
28667,,2014-029020,SPM017505,"Grapholita fana",None,Iowa,Winneshiek,2009-06-26,,"Plymouth Rock-x",0,0,"MJ Hatfield",adult,,Photograph,1,,,,,,,,,
28668,"Jim Durbin Drawer 017",2014-029021,SPM018020,"Grapholita tristrigana","Three-lined Grapholita Moth",Iowa,Linn,2010-06-22,,"Wanatee County Park",42.0094,-91.56623,"Jim Durbin",adult,Blacklight/Fluorescent,Pinned,1,,,,,,,,,
28669,,2014-029022,SPM019509,"Grapholita tristrigana","Three-lined Grapholita Moth",Iowa,Johnson,2010-06-06,,"Iowa City Site 1",41.62806,-91.51417,"Mark Brown",adult,,Photograph,1,,,,,,,,,
28670,,2014-029023,SPM019900,"Grapholita tristrigana","Three-lined Grapholita Moth",Iowa,Harrison,2009-09-30,,"Harrison County",41.694664,-95.815361,"MJ Hatfield",adult,,Pinned,1,,,,,,,,,"Dunn Ranch"
28671,,2014-029024,SPM020030,"Grapholita tristrigana","Three-lined Grapholita Moth",Iowa,Harrison,2009-09-30,,"Harrison County",41.693831,-95.814545,"MJ Hatfield",adult,,Pinned,1,,,,,,,,,"Dunn Ranch"
28672,,2014-029025,SPM020040,"Grapholita tristrigana","Three-lined Grapholita Moth",Iowa,Winneshiek,2010-07-01,,"Plymouth Rock-x",0,0,"MJ Hatfield",adult,,Pinned,1,,,,,,,,,
28673,,2014-029026,SPM020049,"Grapholita tristrigana","Three-lined Grapholita Moth",Iowa,Winneshiek,2010-07-13,,"100 Acre Wood-x",0,0,"MJ Hatfield",adult,,Pinned,1,,,,,,,,,
28674,"Jim Durbin Drawer 017",2014-029027,SPM028163,"Grapholita tristrigana","Three-lined Grapholita Moth",Iowa,Linn,2012-06-10,,"Wakpicada Natural Area",42.18892,-91.52035,"Jim Durbin",adult,Blacklight/Fluorescent,Pinned,1,,,,,,,,,
28675,,2014-029028,SPM028490,"Grapholita tristrigana","Three-lined Grapholita Moth",Iowa,Linn,2012-06-15,,"Matsell Bridge Natural Area",42.13131,-91.38886,"Jim Durbin",adult,Blacklight/Fluorescent,Photograph,1,,,,,,,,,
28676,"Jim Durbin Drawer 017",2014-029029,SPM029694,"Grapholita tristrigana","Three-lined Grapholita Moth",Iowa,Jones,2012-07-01,,"Wapsipinicon State Park",42.09038,-91.2861,"Jim Durbin",adult,Blacklight/Fluorescent,Pinned,1,,,,,,,,,
28677,,2014-029030,SPM035391,"Grapholita tristrigana","Three-lined Grapholita Moth",Iowa,Kossuth,2013-06-25,,Algona,43.06998,-94.23295,"Matt Kenne",adult,,Sighting,1,,,,,,,,,
43361,,2014-043738,SPM028489,"Grapholita tristrigana","Three-lined Grapholita Moth",Iowa,Linn,2012-06-15,,"Matsell Bridge Natural Area",42.13131,-91.38886,"Jim Durbin",adult,Blacklight/Fluorescent,Photograph,1,,,,,,,,,
65000,,2014-065601,,"Grapholita interstinctana","Clover Head Caterpillar Moth",Iowa,Kossuth,2014-05-28,,Algona,43.06998,-94.23295,"Matt Kenne",adult,,Sighting,1,,,,,,,,,
65595,,2014-066197,,"Grapholita interstinctana","Clover Head Caterpillar Moth",Iowa,Kossuth,2014-05-28,,Algona,43.06998,-94.23295,"Matt Kenne",adult,,Sighting,1,,,,,,,,,
66832,,2014-067437,,"Grapholita interstinctana","Clover Head Caterpillar Moth",Iowa,Winneshiek,2012-08-14,,"100 Acre Wood-x",0,0,"MJ Hatfield",adult,,Photograph,1,,,,,,,,,
66851,,2014-067456,,"Grapholita interstinctana","Clover Head Caterpillar Moth",Iowa,Winneshiek,2012-08-14,,"100 Acre Wood-x",0,0,"MJ Hatfield",adult,,Photograph,1,,,,,,,,,
66891,,2014-067496,,"Grapholita interstinctana","Clover Head Caterpillar Moth",Iowa,Winneshiek,2012-08-14,,"100 Acre Wood-x",0,0,"MJ Hatfield",adult,,Photograph,1,,,,,,,,,
126712,"Jim Durbin Drawer 017",2015-017280,,"Grapholita tristrigana","Three-lined Grapholita Moth",Iowa,Linn,2015-06-10,2100-2315,"Pleasant Creek State Recreation Area, Linn County",42.109952,-91.822641,"Jim Durbin",adult,Blacklight/Fluorescent,Pinned,1,82,41,56,6,45,29.75,clear,"40% visible",
126828,,2015-017396,,"Grapholita tristrigana","Three-lined Grapholita Moth",Iowa,Linn,2015-06-10,2100-2315,"Pleasant Creek State Recreation Area, Linn County",42.109952,-91.822641,"Jim Durbin",adult,Blacklight/Fluorescent,Photograph,1,82,41,56,6,45,29.75,clear,"40% visible",
126923,,2015-017485,,"Grapholita tristrigana","Three-lined Grapholita Moth",Iowa,Linn,2015-06-16,"2100 to 2300","Wickiup Hill Outdoor Learning Area",42.087567,-91.767578,"Jim Durbin",adult,Blacklight/Fluorescent,Photograph,1,72,65,60,1,90,30.02,clear,"0% visible",
126932,,2015-017494,,"Grapholita tristrigana","Three-lined Grapholita Moth",Iowa,Linn,2015-06-16,"2100 to 2300","Wickiup Hill Outdoor Learning Area",42.087567,-91.767578,"Jim Durbin",adult,Blacklight/Fluorescent,Photograph,1,72,65,60,1,90,30.02,clear,"0% visible",
127038,,2015-017600,,"Grapholita tristrigana","Three-lined Grapholita Moth",Iowa,Linn,2015-06-16,"2100 to 2300","Wickiup Hill Outdoor Learning Area",42.087567,-91.767578,"Jim Durbin",adult,Blacklight/Fluorescent,Photograph,1,72,65,60,1,90,30.02,clear,"0% visible",
143613,,2016-008349,,"Grapholita fana",None,Iowa,Johnson,2015-07-27,,"F. W. Kent Park",41.7352778,-91.7225,"Mark Brown",adult,,Photograph,1,,,,,,,,,
168648,"Jim Durbin Drawer 017",2016-033393,,"Grapholita tristrigana","Three-lined Grapholita Moth",Iowa,Linn,2016-06-05,2045-2300,"Vecny Woods",41.956725,-91.600854,"Jim Durbin",adult,Blacklight/Fluorescent,Pinned,1,80,36,51,4,300,29.67,"partly cloudy","dark phase",
169209,,2016-033954,,"Grapholita tristrigana","Three-lined Grapholita Moth",Iowa,Linn,2016-06-11,2100-2315,"Vecny Woods",41.956725,-91.600854,"Jim Durbin",adult,Blacklight/Fluorescent,Photograph,1,84,67,72,0,0,29.92,cloudy,"45% visible",
169224,,2016-033969,,"Grapholita tristrigana","Three-lined Grapholita Moth",Iowa,Linn,2016-06-11,2100-2315,"Vecny Woods",41.956725,-91.600854,"Jim Durbin",adult,Blacklight/Fluorescent,Photograph,1,84,67,72,0,0,29.92,cloudy,"45% visible",
171019,,2016-035764,,"Grapholita tristrigana","Three-lined Grapholita Moth",Iowa,Linn,2016-06-27,2100-2330,"Hitaga Sand Ridge Prairie Preserve",42.250957,-91.632098,"Jim Durbin",adult,Blacklight/Fluorescent,Photograph,1,77,59,62,4,300,30.06,"partly cloudy","50% visible",
171113,,2016-035858,,"Grapholita tristrigana","Three-lined Grapholita Moth",Iowa,Linn,2016-06-27,2100-2330,"Hitaga Sand Ridge Prairie Preserve",42.250957,-91.632098,"Jim Durbin",adult,Blacklight/Fluorescent,Photograph,1,77,59,62,4,300,30.06,"partly cloudy","50% visible",
171203,,2016-035948,,"Grapholita tristrigana","Three-lined Grapholita Moth",Iowa,Linn,2016-06-27,2100-2330,"Hitaga Sand Ridge Prairie Preserve",42.250957,-91.632098,"Jim Durbin",adult,Blacklight/Fluorescent,Photograph,1,77,59,62,4,300,30.06,"partly cloudy","50% visible",
171206,,2016-035951,,"Grapholita tristrigana","Three-lined Grapholita Moth",Iowa,Linn,2016-06-27,2100-2330,"Hitaga Sand Ridge Prairie Preserve",42.250957,-91.632098,"Jim Durbin",adult,Blacklight/Fluorescent,Photograph,1,77,59,62,4,300,30.06,"partly cloudy","50% visible",
171431,,2016-036176,,"Grapholita tristrigana","Three-lined Grapholita Moth",Iowa,Linn,2016-07-05,2100-2300,"Hitaga Sand Ridge Prairie Preserve",42.250957,-91.632098,"Jim Durbin",adult,Blacklight/Fluorescent,Photograph,1,80,88,75,4,150,29.76,cloudy,Dark,
181720,,2016-046359,,"Grapholita tristrigana","Three-lined Grapholita Moth",Iowa,Johnson,2016-07-28,,Redacted,Redacted,Redacted,"Mark Brown",adult,,Photograph,1,,,,,,,,,
182508,,2017-000469,,"Grapholita fana",None,Iowa,Johnson,2016-09-14,,"Ciha Fen Wildlife Preserve",41.82917,-91.38278,"Mark Brown",adult,,Photograph,1,,,,,,,,,
182864,,2017-000825,,"Grapholita fana",None,Iowa,Winneshiek,2016-05-18,,"Plymouth Rock-x",0,0,"MJ Hatfield",adult,,Photograph,1,,,,,,,,,
182875,,2017-000836,,"Grapholita fana",None,Iowa,Winneshiek,2016-06-26,,"Plymouth Rock-x",0,0,"MJ Hatfield",adult,,Photograph,1,,,,,,,,,
182937,,2017-000898,,"Grapholita fana",None,Iowa,Winneshiek,2016-05-07,,"Dunning's Spring Park",43.31167,-91.78917,"MJ Hatfield",adult,,Photograph,1,,,,,,,,,
192357,"Jim Durbin Drawer 017",2017-010318,,"Grapholita tristrigana","Three-lined Grapholita Moth",Iowa,Linn,2017-06-10,2100-2330,"Hitaga Sand Ridge Prairie Preserve",42.250957,-91.632098,"Jim Durbin",adult,Blacklight/Fluorescent,Pinned,1,83,54,65,16,190,29.68,clear,Full,
192536,"Jim Durbin Drawer 017",2017-010497,,"Grapholita tristrigana","Three-lined Grapholita Moth",Iowa,Linn,2017-06-14,2100-2330,"Wickiup Hill Outdoor Learning Area",42.087567,-91.767578,"Jim Durbin",adult,Blacklight/Fluorescent,Pinned,1,80,73,71,3,120,29.75,cloudy,"90% visible",
211206,"Jim Durbin Drawer 017",2018-009363,,"Grapholita delineana","Delineated Grapholita Moth",Iowa,Linn,2018-05-30,"2045 - 2315","Hitaga Sand Ridge Prairie Preserve",42.250957,-91.632098,"Jim Durbin",adult,Blacklight/Fluorescent,Pinned,1,77,56,60,7,270,29.59,"partly cloudy",full,
211627,,2018-009784,,"Grapholita tristrigana","Three-lined Grapholita Moth",Iowa,Linn,2018-06-06,2030-2315,"Wickiup Hill Outdoor Learning Area",42.087352,-91.767107,"Jim Durbin",adult,Blacklight/Fluorescent,Photograph,1,74,69,64,5,280,29.83,cloudy,"50% visible",
212282,,2018-010438,,"Grapholita tristrigana","Three-lined Grapholita Moth",Iowa,Linn,2018-06-15,2100-2315,"Wickiup Hill Outdoor Learning Area",42.087352,-91.767107,"Jim Durbin",adult,Blacklight/Florescent,Photograph,1,84,70,73,3,120,29.79,"partly cloudy","0 % visible",
212364,,2018-010520,,"Grapholita tristrigana","Three-lined Grapholita Moth",Iowa,Linn,2018-06-15,2100-2315,"Wickiup Hill Outdoor Learning Area",42.087352,-91.767107,"Jim Durbin",adult,Blacklight/Florescent,Photograph,1,84,70,73,3,120,29.79,"partly cloudy","0 % visible",
213029,,2018-011185,,"Grapholita fana",None,Iowa,Winneshiek,2018-05-28,,"Plymouth Rock-x",0,0,"MJ Hatfield",adult,,Photograph,1,,,,,,,,,
216071,,2018-014227,,"Grapholita delineana","Delineated Grapholita Moth",Iowa,Polk,2016-07-29,,"Water Works Park, Des Moines",41.569,-93.647375,"Aaron Brees",adult,,Photograph,1,,,,,,,,,
216509,,2018-014665,,"Grapholita interstinctana","Clover Head Caterpillar Moth",Iowa,Winneshiek,2018-07-15,,"100 Acre Wood-x",0,0,"MJ Hatfield",adult,,Photograph,1,,,,,,,,,
216527,,2018-014683,,"Grapholita fana",None,Iowa,Winneshiek,2018-07-13,,"Craggy Rocks-x",0,0,"MJ Hatfield",adult,,Photograph,1,,,,,,,,,
217883,,2018-016039,,"Grapholita interstinctana","Clover Head Caterpillar Moth",Iowa,Winneshiek,2018-07-19,,"100 Acre Wood-x",0,0,"MJ Hatfield",adult,"Blacklight Trap",Photograph,1,,,,,,,,,
220542,,2018-018696,,"Grapholita tristrigana","Three-lined Grapholita Moth",Iowa,Winneshiek,2018-09-15,,"100 Acre Wood-x",0,0,"MJ Hatfield",adult,,Photograph,1,,,,,,,,,
224381,"Jim Durbin Drawer 017",2018-022536,,"Grapholita interstinctana","Clover Head Caterpillar Moth",Iowa,Winneshiek,2018-07-19,,"100 Acre Wood-x",0,0,"MJ Hatfield",adult,"Blacklight Trap",Pinned,1,,,,,,,,,
224607,"Jim Durbin Drawer 017",2018-022758,,"Grapholita tristrigana","Three-lined Grapholita Moth",Iowa,Winneshiek,2018-08-18,,"100 Acre Wood-x",0,0,"MJ Hatfield",adult,,Pinned,1,,,,,,,,,
225091,,2019-000085,,"Grapholita interstinctana","Clover Head Caterpillar Moth",Iowa,Johnson,2018-06-03,,"Ciha Fen Wildlife Preserve",41.82917,-91.38278,"Mark Brown",adult,,Photograph,1,,,,,,,,,
230652,,2019-005886,,"Grapholita interstinctana","Clover Head Caterpillar Moth",Iowa,Linn,2019-05-30,,"Hitaga Sand Ridge Prairie Preserve",42.250957,-91.632098,"Jim Durbin",adult,Blacklight/Fluorescent,Photograph,1,68,81,62,,,29.82,"partly cloidy","10% visible",
231894,,2019-006607,,"Grapholita tristrigana","Three-lined Grapholita Moth",Iowa,Linn,2019-06-17,2100-2300,"Hitaga Sand Ridge Prairie Preserve",42.250957,-91.632098,"Jim Durbin",adult,Blacklight/Fluorescent,Photograph,1,71,68,60,5,110,29.97,cloudy,full,
232404,,2019-007117,,"Grapholita tristrigana","Three-lined Grapholita Moth",Iowa,Linn,2019-06-26,"50% visible","Hitaga Sand Ridge Prairie Preserve",42.250957,-91.632098,"Jim Durbin",adult,Blacklight/Fluorescent,Photograph,1,79,69,68,1,100,29.79,clear,,
232526,,2019-007239,,"Grapholita tristrigana","Three-lined Grapholita Moth",Iowa,Linn,2019-06-26,"50% visible","Hitaga Sand Ridge Prairie Preserve",42.250957,-91.632098,"Jim Durbin",adult,Blacklight/Fluorescent,Photograph,1,79,69,68,1,100,29.79,clear,,
232671,,2019-007384,,"Grapholita tristrigana","Three-lined Grapholita Moth",Iowa,Linn,2019-06-26,"50% visible","Hitaga Sand Ridge Prairie Preserve",42.250957,-91.632098,"Jim Durbin",adult,Blacklight/Fluorescent,Photograph,1,79,69,68,1,100,29.79,clear,,
247171,,,,"Grapholita fana",None,Iowa,Wapello,2019-07-07,,"Eddyville Sand Prairie Park",41.154337,-92.620012,"Mark Brown",adult,Sighting,Photograph,1,,,,,,,,,
267933,,,,"Grapholita tristrigana","Three-lined Grapholita Moth",Iowa,Linn,2020-06-28,22:46:52,"Wickiup Hill Outdoor Learning Area",42.08735076,-91.76706884,"Jim Durbin",adult,Blacklight/Fluorescent,Photograph,1,78,76,70,4,110,29.57,clear,"50% visible",
267940,,,,"Grapholita tristrigana","Three-lined Grapholita Moth",Iowa,Linn,2020-06-28,22:25:04,"Wickiup Hill Outdoor Learning Area",42.08735076,-91.76706884,"Jim Durbin",adult,Blacklight/Fluorescent,Photograph,1,78,76,70,4,110,29.57,clear,"50% visible",
267962,,,,"Grapholita tristrigana","Three-lined Grapholita Moth",Iowa,Linn,2020-06-28,22:19:58,"Wickiup Hill Outdoor Learning Area",42.08735076,-91.76706884,"Jim Durbin",adult,Blacklight/Fluorescent,Photograph,1,78,76,70,4,110,29.57,clear,"50% visible",
268131,,,,"Grapholita tristrigana","Three-lined Grapholita Moth",Iowa,Linn,2020-06-28,21:18:55,"Wickiup Hill Outdoor Learning Area",42.08735076,-91.76706884,"Jim Durbin",adult,Blacklight/Fluorescent,Photograph,1,78,76,70,4,110,29.57,clear,"50% visible",
268137,,,,"Grapholita tristrigana","Three-lined Grapholita Moth",Iowa,Linn,2020-06-28,21:15:32,"Wickiup Hill Outdoor Learning Area",42.08735076,-91.76706884,"Jim Durbin",adult,Blacklight/Fluorescent,Photograph,1,78,76,70,4,110,29.57,clear,"50% visible",
268390,,,,"Grapholita tristrigana","Three-lined Grapholita Moth",Iowa,Linn,2020-06-30,21:37:18,"Hitaga Sand Ridge Prairie Preserve",42.25088735,-91.63212362,"Jim Durbin",adult,Blacklight/Fluorescent,Photograph,1,78,88,74,2,100,29.85,cloudy,"80% visible",
268406,,,,"Grapholita tristrigana","Three-lined Grapholita Moth",Iowa,Linn,2020-06-30,21:32:04,"Hitaga Sand Ridge Prairie Preserve",42.25088735,-91.63212362,"Jim Durbin",adult,Blacklight/Fluorescent,Photograph,1,78,88,74,2,100,29.85,cloudy,"80% visible",
268669,,,,"Grapholita interstinctana","Clover Head Caterpillar Moth",Iowa,Linn,2020-07-20,2100,"Hitaga Sand Ridge Prairie Preserve",42.250928,-91.63211,"Jim Durbin",adult,Blacklight/Fluorescent,Photograph,1,71,75,63,3,110,29.61,clear,new,
269918,,,,"Grapholita tristrigana","Three-lined Grapholita Moth",Iowa,Linn,2020-08-08,21:23:09,"Hitaga Sand Ridge Prairie Preserve",42.25088607,-91.63213435,"Jim Durbin",adult,Blacklight/Fluorescent,Photograph,1,78,81,71,7,180,30.02,clear,"80% visible",
269919,,,,"Grapholita tristrigana","Three-lined Grapholita Moth",Iowa,Linn,2020-08-08,21:23:02,"Hitaga Sand Ridge Prairie Preserve",42.25088607,-91.63213435,"Jim Durbin",adult,Blacklight/Fluorescent,Photograph,1,78,81,71,7,180,30.02,clear,"80% visible",
310353,,,,"Grapholita tristrigana","Three-lined Grapholita Moth",Iowa,Linn,2022-06-16,22:52:01,"Wanatee County Park",42.01007932,-91.56651807,"Jim Durbin",adult,Blacklight/Fluorescent,Photograph,1,77,50,57,8,270,29.96,clear,full,
310522,,,,"Grapholita tristrigana","Three-lined Grapholita Moth",Iowa,Linn,2022-06-16,21:35:18,"Wanatee County Park",42.01007932,-91.56651807,"Jim Durbin",adult,Blacklight/Fluorescent,Photograph,1,77,50,57,8,270,29.96,clear,full,
310546,,,,"Grapholita tristrigana","Three-lined Grapholita Moth",Iowa,Linn,2022-06-16,21:19:09,"Wanatee County Park",42.01007932,-91.56651807,"Jim Durbin",adult,Blacklight/Fluorescent,Photograph,1,77,50,57,8,270,29.96,clear,full,
310555,,,,"Grapholita tristrigana","Three-lined Grapholita Moth",Iowa,Linn,2022-06-16,21:06:42,"Wanatee County Park",42.01007932,-91.56651807,"Jim Durbin",adult,Blacklight/Fluorescent,Photograph,1,77,50,57,8,270,29.96,clear,full,
310559,,,,"Grapholita tristrigana","Three-lined Grapholita Moth",Iowa,Linn,2022-06-16,21:05:02,"Wanatee County Park",42.01007932,-91.56651807,"Jim Durbin",adult,Blacklight/Fluorescent,Photograph,1,77,50,57,8,270,29.96,clear,full,
310560,,,,"Grapholita tristrigana","Three-lined Grapholita Moth",Iowa,Linn,2022-06-16,21:04:55,"Wanatee County Park",42.01007932,-91.56651807,"Jim Durbin",adult,Blacklight/Fluorescent,Photograph,1,77,50,57,8,270,29.96,clear,full,
310915,,,,"Grapholita tristrigana","Three-lined Grapholita Moth",Iowa,Linn,2022-06-24,21:30:43,"Pinicon Ridge Park",42.21090343,-91.54429735,"Jim Durbin",adult,Blacklight/Fluorescent,Photograph,1,75,67,62,8,180,29.96,"partly cloudy","40% moon",
311219,,,,"Grapholita tristrigana","Three-lined Grapholita Moth",Iowa,Linn,2022-06-28,21:23:24,"Hitaga Sand Ridge Prairie Preserve",42.2510735,-91.63217209,"Jim Durbin",adult,Blacklight/Fluorescent,Photograph,1,75,50,56,6,270,30.04,"partly cloudy","new moon",
312192,,,,"Grapholita tristrigana","Three-lined Grapholita Moth",Iowa,Linn,2022-07-18,21:50:44,"Wanatee County Park",42.01008617,-91.56657306,"Jim Durbin",adult,Sighting,Photograph,1,77,93,75,0,0,29.98,clear,"90% visible",
312199,,,,"Grapholita tristrigana","Three-lined Grapholita Moth",Iowa,Linn,2022-07-18,21:35:53,"Wanatee County Park",42.01008617,-91.56657306,"Jim Durbin",adult,Sighting,Photograph,1,77,93,75,0,0,29.98,clear,"90% visible",
312317,,,,"Grapholita tristrigana","Three-lined Grapholita Moth",Iowa,Johnson,2022-07-23,22:28:47,"F. W. Kent Park",41.73491869,-91.72188289,"Jim Durbin",adult,Blacklight/Fluorescent,Photograph,1,88,65,74,12,190,29.81,cloudy,"40 % visible",
312456,,,,"Grapholita tristrigana","Three-lined Grapholita Moth",Iowa,Johnson,2022-07-23,21:21:11,"F. W. Kent Park",41.73491869,-91.72188289,"Jim Durbin",adult,Blacklight/Fluorescent,Photograph,1,88,65,74,12,190,29.81,cloudy,"40 % visible",
314890,,,,"Grapholita interstinctana","Clover Head Caterpillar Moth",Iowa,Johnson,2022-05-31,,Redacted,Redacted,Redacted,"Mark Brown",adult,Sighting,Photograph,1,,,,,,,,,
332909,,,,"Grapholita tristrigana","Three-lined Grapholita Moth",Iowa,Johnson,2022-08-10,19:08:22,"Clear Creek Trail-Coralville Segment",41.67236738166667,-91.58789306833333,"Mark Brown",adult,Sighting,Photograph,1,,,,,,,,,
343707,,,,"Grapholita tristrigana","Three-lined Grapholita Moth",Iowa,Allamakee,2023-07-15,,"Effigy Mounds National Monument",43.091144,-91.189094,"Mark Brown",adult,Sighting,Photograph,1,,,,,,,,,
345058,,,,"Grapholita fana",None,Iowa,Johnson,2023-07-23,,"MacBride Nature Recreation Area",41.786966,-91.568436,"Mark Brown",adult,Sighting,Photograph,1,,,,,,,,,
345334,,,,"Grapholita fana",None,Iowa,Johnson,2023-07-23,18:51:17,"MacBride Nature Recreation Area",41.786887861667,-91.56850911,"Mark Brown",adult,Sighting,Photograph,1,,,,,,,,,
348451,,,,"Grapholita fana",None,Iowa,Butler,2023-05-27,11:58:45,"Wolter's Prairie Preserve",42.773224,-92.712847,"Kenneth Heiar",adult,Sighting,Photograph,1,,,,,,,,,
