ID,"Collection / Source","Catalog Number","Specify Number",Taxon,"Common Name",State,County,Date,Time,Locale,Latitude,Longitude,Collector,"Life Stage","Collection Method","Preparation Type",Count,Temperature,Humidity,"Dew Point",Wind,"Wind Direction","Barometric Pressure",Sky,"Moon Phase",Notes
800,"Jim Durbin Drawer 107",2014-000800,SPM011152,"Phragmatobia fuliginosa","Ruby Tiger Moth",Iowa,Clayton,2008-07-15,,"Bixby State Preserve",42.67502,-91.3988,"Jim Durbin",adult,Blacklight/Fluorescent,Pinned,1,,,,,,,,,
892,,2014-000892,SPM000109,"Phragmatobia assimilans","Large Ruby Tiger Moth",Iowa,Linn,2003-08-29,,"Behren's Pond Woodland State Preserve",42.118214,-91.754324,"Jim Durbin",adult,Blacklight/Fluorescent,Sighting,1,,,,,,,,,
1307,,2014-001307,SPM000110,"Phragmatobia assimilans","Large Ruby Tiger Moth",Iowa,Linn,2003-07-23,,"Wanatee County Park",42.0094,-91.56623,"Jim Durbin",adult,Blacklight/Fluorescent,Sighting,1,,,,,,,,,
4754,,2014-005035,,"Phragmatobia fuliginosa","Ruby Tiger Moth",Iowa,Montgomery,1950-07-15,,"Anderson Conservation Area",41.043884,-95.184921," USGS - NPWRC",adult,,Sighting,1,,,,,,,,,"HIstorical Record"
4755,,2014-005036,,"Phragmatobia fuliginosa","Ruby Tiger Moth",Iowa,Woodbury,1950-07-15,,"Woodbury County",42.316616,-95.983261," USGS - NPWRC",adult,,Sighting,1,,,,,,,,,"HIstorical Record"
12271,"Jim Durbin Drawer 107",2014-012553,SPM042529,"Phragmatobia fuliginosa","Ruby Tiger Moth",Iowa,Linn,2014-07-21,,"Pleasant Creek State Recreation Area, Linn County",42.10948,-91.8249,"Jim Durbin",adult,Blacklight/Fluorescent,Pinned,1,,,,,,,,,
41819,"Jim Durbin Drawer 107",2014-042196,SPM004485,"Phragmatobia fuliginosa","Ruby Tiger Moth",Iowa,Linn,2005-06-25,,"Wickiup Hill Outdoor Learning Area",42.08398,-91.7651,"Jim Durbin",adult,Blacklight/Fluorescent,Pinned,1,,,,,,,,,
41820,"Jim Durbin Drawer 107",2014-042197,SPM006589,"Phragmatobia lineata","Lined Ruby Tiger Moth",Iowa,Linn,2006-06-29,,"Wickiup Hill Outdoor Learning Area",42.08398,-91.7651,"Jim Durbin",adult,Blacklight/Fluorescent,Pinned,1,,,,,,,,,
41821,"Frank Olsen Drawer 56",2014-042198,SPM007722,"Phragmatobia fuliginosa","Ruby Tiger Moth",Iowa,Floyd,2006-08-22,,"Rockford Fossil & Prairie Park Preserve",43.04778,-92.97113,"Frank Olsen",adult,,Pinned,1,,,,,,,,,"Located at Iowa State"
41822,"Jim Durbin Drawer 107",2014-042199,SPM018069,"Phragmatobia lineata","Lined Ruby Tiger Moth",Iowa,Allamakee,2010-06-25,,"Yellow River State Forest",43.13753,-91.22503,"Jim Durbin",adult,Blacklight/Fluorescent,Pinned,1,,,,,,,,,
41823,,2014-042200,SPM019818,"Phragmatobia fuliginosa","Ruby Tiger Moth",Iowa,Johnson,2010-06-21,,"Iowa City Site 1",41.62806,-91.51417,"Mark Brown",adult,,Photograph,1,,,,,,,,,
41824,,2014-042201,SPM021578,"Phragmatobia assimilans","Large Ruby Tiger Moth",Iowa,Jefferson,2010-06-21,,"Near Fairfield",41.0503,-92.024,"Moni Hayne",adult,Blacklight/Fluorescent,Photograph,1,,,,,,,,,
41825,,2014-042202,SPM021579,"Phragmatobia assimilans","Large Ruby Tiger Moth",Iowa,Jefferson,2010-08-01,,"Near Fairfield",41.0503,-92.024,"Moni Hayne",adult,Blacklight/Fluorescent,Photograph,1,,,,,,,,,
41826,"Frank Olsen Drawer 56",2014-042203,SPM024577,"Phragmatobia fuliginosa","Ruby Tiger Moth",Iowa,"Black Hawk",2011-08-19,,"Cedar Hills Sand Prairie Preserve",42.59305,-92.55315,"Frank Olsen",adult,,Pinned,1,,,,,,,,,"Located at Iowa State"
41827,"Jim Durbin Drawer 107",2014-042204,SPM033798,"Phragmatobia assimilans","Large Ruby Tiger Moth",Minnesota,"Saint Louis",2013-06-11,,Redacted,Redacted,Redacted,"Jim Durbin",adult,Blacklight/Fluorescent,Pinned,1,,,,,,,,,
41828,,2014-042205,SPM033891,"Phragmatobia assimilans","Large Ruby Tiger Moth",Minnesota,"Saint Louis",2013-06-11,,Redacted,Redacted,Redacted,"Jim Durbin",adult,Blacklight/Fluorescent,Photograph,1,,,,,,,,,
41829,,2014-042206,SPM033914,"Phragmatobia assimilans","Large Ruby Tiger Moth",Minnesota,"Saint Louis",2013-06-11,,Redacted,Redacted,Redacted,"Jim Durbin",adult,Blacklight/Fluorescent,Photograph,1,,,,,,,,,
41830,,2014-042207,SPM033920,"Phragmatobia fuliginosa","Ruby Tiger Moth",Minnesota,"Saint Louis",2013-06-11,,Redacted,Redacted,Redacted,"Jim Durbin",adult,Blacklight/Fluorescent,Photograph,1,,,,,,,,,
41831,,2014-042208,SPM037791,"Phragmatobia assimilans","Large Ruby Tiger Moth",Iowa,Jefferson,2009-07-25,,"Near Fairfield",41.0503,-92.024,"Moni Hayne",adult,Blacklight/Fluorescent,Photograph,1,,,,,,,,,
41832,,2014-042209,SPM037792,"Phragmatobia assimilans","Large Ruby Tiger Moth",Iowa,Jefferson,2009-07-25,,"Near Fairfield",41.0503,-92.024,"Moni Hayne",adult,Blacklight/Fluorescent,Photograph,1,,,,,,,,,
41833,,2014-042210,SPM037813,"Phragmatobia assimilans","Large Ruby Tiger Moth",Iowa,Jefferson,2009-07-26,,"Near Fairfield",41.0503,-92.024,"Moni Hayne",adult,Blacklight/Fluorescent,Photograph,1,,,,,,,,,
41834,,2014-042211,SPM037855,"Phragmatobia assimilans","Large Ruby Tiger Moth",Iowa,Jefferson,2009-08-11,,"Near Fairfield",41.0503,-92.024,"Moni Hayne",adult,Blacklight/Fluorescent,Photograph,1,,,,,,,,,
41835,,2014-042212,SPM037970,"Phragmatobia assimilans","Large Ruby Tiger Moth",Iowa,Jefferson,2009-08-15,,"Near Fairfield",41.0503,-92.024,"Moni Hayne",adult,Blacklight/Fluorescent,Photograph,1,,,,,,,,,
41836,,2014-042213,SPM037984,"Phragmatobia fuliginosa","Ruby Tiger Moth",Iowa,Jefferson,2009-08-28,,"Near Fairfield",41.0503,-92.024,"Moni Hayne",adult,Blacklight/Fluorescent,Photograph,1,,,,,,,,,
41837,,2014-042214,SPM037985,"Phragmatobia fuliginosa","Ruby Tiger Moth",Iowa,Jefferson,2009-08-28,,"Near Fairfield",41.0503,-92.024,"Moni Hayne",adult,Blacklight/Fluorescent,Photograph,1,,,,,,,,,
41838,,2014-042215,SPM037986,"Phragmatobia fuliginosa","Ruby Tiger Moth",Iowa,Jefferson,2009-08-28,,"Near Fairfield",41.0503,-92.024,"Moni Hayne",adult,Blacklight/Fluorescent,Photograph,1,,,,,,,,,
41839,,2014-042216,SPM038095,"Phragmatobia assimilans","Large Ruby Tiger Moth",Iowa,Jefferson,2011-04-10,,"Near Fairfield",41.0503,-92.024,"Moni Hayne",adult,Blacklight/Fluorescent,Photograph,1,,,,,,,,,
41840,,2014-042217,SPM038171,"Phragmatobia fuliginosa","Ruby Tiger Moth",Iowa,Jefferson,2011-07-02,,"Near Fairfield",41.0503,-92.024,"Moni Hayne",adult,Blacklight/Fluorescent,Photograph,1,,,,,,,,,
41841,"Jim Durbin Drawer 107",2014-042218,SPM003834,"Phragmatobia fuliginosa","Ruby Tiger Moth",Iowa,Linn,2005-04-19,,"Wanatee County Park",42.0094,-91.56623,"Jim Durbin",adult,Blacklight/Fluorescent,Pinned,1,,,,,,,,,
41842,"Frank Olsen Drawer 56",2014-042219,SPM007720,"Phragmatobia fuliginosa","Ruby Tiger Moth",Iowa,Floyd,2006-07-27,,"Rockford Fossil & Prairie Park Preserve",43.04778,-92.97113,"Frank Olsen",adult,,Pinned,1,,,,,,,,,"Located at Iowa State"
41843,"Jim Durbin Drawer 107",2014-042220,SPM008465,"Phragmatobia fuliginosa","Ruby Tiger Moth",Iowa,Linn,2007-05-14,,"Wickiup Hill Outdoor Learning Area",42.08398,-91.7651,"Jim Durbin",adult,Blacklight/Fluorescent,Pinned,1,,,,,,,,,
41844,"Frank Olsen Drawer 56",2014-042221,SPM020536,"Phragmatobia fuliginosa","Ruby Tiger Moth",Iowa,Linn,2010-08-09,,"Wickiup Hill Outdoor Learning Area",42.08398,-91.7651,"Frank Olsen",adult,,Pinned,1,,,,,,,,,"Located at Iowa State"
41845,"Frank Olsen Drawer 56",2014-042222,SPM020537,"Phragmatobia fuliginosa","Ruby Tiger Moth",Iowa,Linn,2010-08-06,,"Wickiup Hill Outdoor Learning Area",42.08398,-91.7651,"Frank Olsen",adult,,Pinned,1,,,,,,,,,"Located at Iowa State"
41846,,2014-042223,SPM021577,"Phragmatobia assimilans","Large Ruby Tiger Moth",Iowa,Jefferson,2010-06-29,,"Near Fairfield",41.0503,-92.024,"Moni Hayne",adult,Blacklight/Fluorescent,Photograph,1,,,,,,,,,
41847,"Jim Durbin Drawer 107",2014-042224,SPM024572,"Phragmatobia fuliginosa","Ruby Tiger Moth",Iowa,Buchanan,2011-05-12,,"Rowley Fen",42.37694,-91.85194,"Frank Olsen",adult,Blacklight/Florescent,Pinned,1,,,,,,,,,
41848,"Frank Olsen Drawer 56",2014-042225,SPM024573,"Phragmatobia fuliginosa","Ruby Tiger Moth",Iowa,Buchanan,2011-05-12,,"Rowley Fen",42.37694,-91.85194,"Frank Olsen",adult,,Pinned,1,,,,,,,,,"Located at Iowa State"
41849,"Frank Olsen Drawer 56",2014-042226,SPM024574,"Phragmatobia fuliginosa","Ruby Tiger Moth",Iowa,"Van Buren",2011-05-10,,"Shimek State Forest, Farmington Unit",40.6659,-91.73637,"Frank Olsen",adult,,Pinned,1,,,,,,,,,"Located at Iowa State"
41850,"Frank Olsen Drawer 56",2014-042227,SPM024575,"Phragmatobia fuliginosa","Ruby Tiger Moth",Iowa,"Black Hawk",2011-05-21,,"Cedar Hills Sand Prairie Preserve",42.59305,-92.55315,"Frank Olsen",adult,,Pinned,1,,,,,,,,,"Located at Iowa State"
41851,"Frank Olsen Drawer 56",2014-042228,SPM024576,"Phragmatobia fuliginosa","Ruby Tiger Moth",Iowa,Linn,2011-06-27,,"Wickiup Hill Outdoor Learning Area",42.08398,-91.7651,"Frank Olsen",adult,,Pinned,1,,,,,,,,,"Located at Iowa State"
41852,"Frank Olsen Drawer 56",2014-042229,SPM024684,"Phragmatobia fuliginosa","Ruby Tiger Moth",Iowa,Marshall,2011-08-31,,"Marietta Sand Prairie State Preserve",42.099164,-93.038965,"Frank Olsen",adult,,Pinned,1,,,,,,,,,"Located at Iowa State"
41853,"Frank Olsen Drawer 56",2014-042230,SPM032346,"Phragmatobia fuliginosa","Ruby Tiger Moth",Iowa,Dubuque,2012-07-10,,"Mines of Spain State Recreational Area",42.4453,-90.62293,"Frank Olsen",adult,,Pinned,1,,,,,,,,,"Located at Iowa State"
41854,,2014-042231,SPM033249,"Phragmatobia fuliginosa","Ruby Tiger Moth",Iowa,Montgomery,1950-07-15,,"Anderson Conservation Area",41.04388,-95.18492," BAMONA",adult,,Sighting,1,,,,,,,,,"HIstorical Record"
41855,,2014-042232,SPM033333,"Phragmatobia fuliginosa","Ruby Tiger Moth",Iowa,Woodbury,1950-07-15,,"Woodbury County",42.31662,-95.98326," unknown",adult,,Sighting,1,,,,,,,,,"HIstorical Record"
41856,,2014-042233,SPM036439,"Phragmatobia fuliginosa","Ruby Tiger Moth",Minnesota,"Saint Louis",2013-06-11,,Redacted,Redacted,Redacted,"Jim Durbin",adult,Blacklight/Fluorescent,Photograph,1,,,,,,,,,
41857,,2014-042234,SPM037853,"Phragmatobia fuliginosa","Ruby Tiger Moth",Iowa,Jefferson,2009-08-11,,"Near Fairfield",41.0503,-92.024,"Moni Hayne",adult,Blacklight/Fluorescent,Photograph,1,,,,,,,,,
41858,,2014-042235,SPM002378,"Phragmatobia lineata","Lined Ruby Tiger Moth",Iowa,Linn,2003-08-16,,"Wanatee County Park",42.00994,-91.57749,"Frank Olsen",adult,,Pinned,1,,,,,,,,,"to verify"
41859,"Frank Olsen Drawer 56",2014-042236,SPM002815,"Phragmatobia fuliginosa","Ruby Tiger Moth",Iowa,Linn,2004-09-01,,"Wickiup Hill Outdoor Learning Area",42.08398,-91.7651,"Frank Olsen",adult,,Pinned,1,,,,,,,,,"Located at Iowa State"
41860,"Frank Olsen Drawer 56",2014-042237,SPM002816,"Phragmatobia fuliginosa","Ruby Tiger Moth",Iowa,Linn,2004-09-01,,"Wickiup Hill Outdoor Learning Area",42.08398,-91.7651,"Frank Olsen",adult,,Pinned,1,,,,,,,,,"Located at Iowa State"
41861,,2014-042238,SPM003664,"Phragmatobia lineata","Lined Ruby Tiger Moth",Iowa,Jasper,2003-05-15,,"Neal Smith National Wildlife Refuge",41.5678,-93.2675,"Keith Summerville",adult,,Pinned,1,,,,,,,,,
41862,"Jim Durbin Drawer 107",2014-042239,SPM003875,"Phragmatobia assimilans","Large Ruby Tiger Moth",Iowa,Howard,2004-07-12,,"Hayden Prairie State Wildlife Management Area",43.44055,-92.38058,"Frank Olsen",adult,Blacklight/Florescent,Pinned,1,,,,,,,,,
41863,,2014-042240,SPM003876,"Phragmatobia fuliginosa","Ruby Tiger Moth",Iowa,Howard,2004-07-12,,"Hayden Prairie State Wildlife Management Area",43.44055,-92.38058,"Frank Olsen",adult,,Pinned,1,,,,,,,,,"to verify"
41864,,2014-042241,SPM003877,"Phragmatobia lineata","Lined Ruby Tiger Moth",Iowa,Howard,2004-07-12,,"Hayden Prairie State Wildlife Management Area",43.44055,-92.38058,"Frank Olsen",adult,,Pinned,1,,,,,,,,,"to verify"
41865,,2014-042242,SPM003878,"Phragmatobia lineata","Lined Ruby Tiger Moth",Iowa,Linn,2004-06-15,,"Wickiup Hill Outdoor Learning Area",42.08398,-91.7651,"Frank Olsen",adult,,Pinned,1,,,,,,,,,"to verify"
41866,,2014-042243,SPM003879,"Phragmatobia lineata","Lined Ruby Tiger Moth",Iowa,Linn,2004-04-28,,"Wickiup Hill Outdoor Learning Area",42.08398,-91.7651,"Frank Olsen",adult,,Pinned,1,,,,,,,,,"to verify"
41867,,2014-042244,SPM003880,"Phragmatobia lineata","Lined Ruby Tiger Moth",Iowa,Linn,2004-04-28,,"Wickiup Hill Outdoor Learning Area",42.08398,-91.7651,"Frank Olsen",adult,,Pinned,1,,,,,,,,,"to verify"
41868,,2014-042245,SPM003881,"Phragmatobia lineata","Lined Ruby Tiger Moth",Iowa,Linn,2004-08-08,,"Wickiup Hill Outdoor Learning Area",42.08398,-91.7651,"Frank Olsen",adult,,Pinned,1,,,,,,,,,"to verify"
41869,,2014-042246,SPM003882,"Phragmatobia lineata","Lined Ruby Tiger Moth",Iowa,Linn,2004-08-08,,"Wickiup Hill Outdoor Learning Area",42.08398,-91.7651,"Frank Olsen",adult,,Pinned,1,,,,,,,,,"to verify"
41870,,2014-042247,SPM003883,"Phragmatobia lineata","Lined Ruby Tiger Moth",Iowa,Linn,2004-08-17,,"Wickiup Hill Outdoor Learning Area",42.08398,-91.7651,"Frank Olsen",adult,,Pinned,1,,,,,,,,,"to verify"
41871,"Frank Olsen Drawer 56",2014-042248,SPM005601,"Phragmatobia fuliginosa","Ruby Tiger Moth",Iowa,Linn,2005-04-06,,"79 Partiridge Ave",42.049481,-91.607059,"Doug Veal",adult,,Pinned,1,,,,,,,,,"Located at Iowa State"
41872,"Frank Olsen Drawer 56",2014-042249,SPM005602,"Phragmatobia fuliginosa","Ruby Tiger Moth",Iowa,Appanoose,2002-06-27,,"Prairie Ridge Park",40.87333,-92.88983,"Dennis Schlicht",adult,,Pinned,1,,,,,,,,,"Located at Iowa State"
41873,"Frank Olsen Drawer 56",2014-042250,SPM007721,"Phragmatobia fuliginosa","Ruby Tiger Moth",Iowa,Floyd,2006-08-22,,"Rockford Fossil & Prairie Park Preserve",43.04778,-92.97113,"Frank Olsen",adult,,Pinned,1,,,,,,,,,"Located at Iowa State"
41874,,2014-042251,SPM008104,"Phragmatobia lineata","Lined Ruby Tiger Moth",Iowa,Jasper,2005-05-25,,"Neal Smith National Wildlife Refuge",41.54245,-93.2908,"Keith Summerville",adult,,Pinned,1,,,,,,,,,
41875,"Jim Durbin Drawer 107",2014-042252,SPM009176,"Phragmatobia lineata","Lined Ruby Tiger Moth",Iowa,Linn,2007-08-17,,"Wanatee County Park",42.0094,-91.56623,"Jim Durbin",adult,Blacklight/Fluorescent,Pinned,1,,,,,,,,,
41876,"Jim Durbin Drawer 107",2014-042253,SPM009179,"Phragmatobia lineata","Lined Ruby Tiger Moth",Iowa,Linn,2007-08-17,,"Wanatee County Park",42.0094,-91.56623,"Jim Durbin",adult,Blacklight/Fluorescent,Pinned,1,,,,,,,,,
41877,"Jim Durbin Drawer 107",2014-042254,SPM009351,"Phragmatobia lineata","Lined Ruby Tiger Moth",Iowa,Linn,2007-08-21,,"Wickiup Hill Outdoor Learning Area",42.08398,-91.7651,"Jim Durbin",adult,Blacklight/Fluorescent,Pinned,1,,,,,,,,,
41878,"Jim Durbin Drawer 107",2014-042255,SPM009355,"Phragmatobia lineata","Lined Ruby Tiger Moth",Iowa,Linn,2007-08-21,,"Wickiup Hill Outdoor Learning Area",42.08398,-91.7651,"Jim Durbin",adult,Blacklight/Fluorescent,Pinned,1,,,,,,,,,
41879,"Frank Olsen Drawer 56",2014-042256,SPM012790,"Phragmatobia fuliginosa","Ruby Tiger Moth",Iowa,Buchanan,2008-08-20,,"Rowley Fen",42.376076,-91.852014,"Frank Olsen",adult,,Pinned,1,,,,,,,,,"Located at Iowa State"
41880,,2014-042257,SPM013249,"Phragmatobia lineata","Lined Ruby Tiger Moth",Iowa,Howard,2004-07-12,,"Hayden Prairie State Wildlife Management Area",43.44055,-92.38058,"Frank Olsen",adult,,Pinned,1,,,,,,,,,"to verify"
41881,,2014-042258,SPM013250,"Phragmatobia lineata","Lined Ruby Tiger Moth",Iowa,Howard,2004-07-12,,"Hayden Prairie State Wildlife Management Area",43.44055,-92.38058,"Frank Olsen",adult,,Pinned,1,,,,,,,,,"to verify"
41882,"Frank Olsen Drawer 56",2014-042259,SPM013251,"Phragmatobia fuliginosa","Ruby Tiger Moth",Iowa,Howard,2004-07-12,,"Hayden Prairie State Wildlife Management Area",43.44055,-92.38058,"Frank Olsen",adult,,Pinned,1,,,,,,,,,"Located at Iowa State"
41883,"Frank Olsen Drawer 56",2014-042260,SPM013252,"Phragmatobia lineata","Lined Ruby Tiger Moth",Iowa,Linn,2004-08-17,,"Wickiup Hill Outdoor Learning Area",42.08398,-91.7651,"Frank Olsen",adult,,Pinned,1,,,,,,,,,"Located at Iowa State"
41884,"Frank Olsen Drawer 56",2014-042261,SPM013253,"Phragmatobia fuliginosa","Ruby Tiger Moth",Iowa,Linn,2004-08-08,,"Wickiup Hill Outdoor Learning Area",42.08398,-91.7651,"Frank Olsen",adult,,Pinned,1,,,,,,,,,"Located at Iowa State"
41885,"Frank Olsen Drawer 56",2014-042262,SPM013254,"Phragmatobia lineata","Lined Ruby Tiger Moth",Iowa,Linn,2004-08-08,,"Wickiup Hill Outdoor Learning Area",42.08398,-91.7651,"Frank Olsen",adult,,Pinned,1,,,,,,,,,"Located at Iowa State"
41886,"Frank Olsen Drawer 56",2014-042263,SPM013255,"Phragmatobia lineata","Lined Ruby Tiger Moth",Iowa,Linn,2004-06-15,,"Wickiup Hill Outdoor Learning Area",42.08398,-91.7651,"Frank Olsen",adult,,Pinned,1,,,,,,,,,"Located at Iowa State"
41887,"Frank Olsen Drawer 56",2014-042264,SPM013256,"Phragmatobia fuliginosa","Ruby Tiger Moth",Iowa,Linn,2004-04-28,,"Wickiup Hill Outdoor Learning Area",42.08398,-91.7651,"Frank Olsen",adult,,Pinned,1,,,,,,,,,"Located at Iowa State"
41888,"Frank Olsen Drawer 56",2014-042265,SPM013257,"Phragmatobia fuliginosa","Ruby Tiger Moth",Iowa,Linn,2004-04-28,,"Wickiup Hill Outdoor Learning Area",42.08398,-91.7651,"Frank Olsen",adult,,Pinned,1,,,,,,,,,"Located at Iowa State"
41889,"Jim Durbin Drawer 107",2014-042266,SPM018501,"Phragmatobia fuliginosa","Ruby Tiger Moth",Iowa,Allamakee,2010-07-12,,"Yellow River State Forest",43.1676,-91.254,"Jim Durbin",adult,Blacklight/Fluorescent,Pinned,1,,,,,,,,,
41890,,2014-042267,SPM019961,"Phragmatobia fuliginosa","Ruby Tiger Moth",Iowa,Johnson,2009-06-25,,"Iowa City Site 1",41.62806,-91.51417,"Mark Brown",adult,,Photograph,1,,,,,,,,,
41891,"Frank Olsen Drawer 56",2014-042268,SPM020216,"Phragmatobia lineata","Lined Ruby Tiger Moth",Iowa,Decatur,2010-06-13,,"Wirth-Springer Woods",40.7554,-93.8738,"Frank Olsen",adult,,Pinned,1,,,,,,,,,"Located at Iowa State"
41892,"Frank Olsen Drawer 56",2014-042269,SPM020538,"Phragmatobia lineata","Lined Ruby Tiger Moth",Iowa,Linn,2010-08-06,,"Wickiup Hill Outdoor Learning Area",42.08398,-91.7651,"Frank Olsen",adult,,Pinned,1,,,,,,,,,"Located at Iowa State"
41893,"Jim Durbin Drawer 107",2014-042270,SPM023001,"Phragmatobia fuliginosa","Ruby Tiger Moth",Iowa,Linn,2011-07-10,,"Wickiup Hill Outdoor Learning Area",42.08398,-91.7651,"Jim Durbin",adult,Blacklight/Fluorescent,Pinned,1,,,,,,,,,
41894,"Jim Durbin Drawer 107",2014-042271,SPM023002,"Phragmatobia fuliginosa","Ruby Tiger Moth",Iowa,Linn,2011-07-10,,"Wickiup Hill Outdoor Learning Area",42.08398,-91.7651,"Jim Durbin",adult,Blacklight/Fluorescent,Pinned,1,,,,,,,,,
41895,,2014-042272,SPM023606,"Phragmatobia fuliginosa","Ruby Tiger Moth",Iowa,Winneshiek,2011-08-27,,"Luther College Sign",43.31972,-91.81333,"Jim Durbin",adult,Blacklight/Fluorescent,Photograph,1,,,,,,,,,
41896,,2014-042273,SPM025360,"Phragmatobia lineata","Lined Ruby Tiger Moth",Iowa,Polk,2011-05-18,,"Puccoon Prairie",41.73528,-93.36417,"Keith Summerville",adult,,Sighting,1,,,,,,,,,
41897,,2014-042274,SPM025825,"Phragmatobia lineata","Lined Ruby Tiger Moth",Iowa,Polk,2011-05-18,,"Chichaqua Bottoms Sandhill Prairie",41.77278,-93.385,"Keith Summerville",adult,,Sighting,1,,,,,,,,,
41898,,2014-042275,SPM025938,"Phragmatobia lineata","Lined Ruby Tiger Moth",Iowa,Polk,2011-05-18,,Redacted,Redacted,Redacted,"Keith Summerville",adult,,Sighting,1,,,,,,,,,
41899,,2014-042276,SPM026046,"Phragmatobia lineata","Lined Ruby Tiger Moth",Iowa,Polk,2011-05-18,,"Chichaqua Bottoms Sandhill Prairie",41.77167,-93.38361,"Keith Summerville",adult,,Sighting,1,,,,,,,,,
41900,"Frank Olsen Drawer 56",2014-042277,SPM032347,"Phragmatobia fuliginosa","Ruby Tiger Moth",Iowa,Linn,2012-08-03,,"Wickiup Hill Outdoor Learning Area",42.08398,-91.7651,"Frank Olsen",adult,,Pinned,1,,,,,,,,,"Located at Iowa State"
41901,"Frank Olsen Drawer 56",2014-042278,SPM032936,"Phragmatobia lineata","Lined Ruby Tiger Moth",Iowa,Appanoose,2002-06-27,,"Prairie Ridge Park",40.87333,-92.88983,"Dennis Schlicht",adult,,Pinned,1,,,,,,,,,"Located at Iowa State"
41902,,2014-042279,SPM037854,"Phragmatobia lineata","Lined Ruby Tiger Moth",Iowa,Jefferson,2009-08-11,,"Near Fairfield",41.0503,-92.024,"Moni Hayne",adult,Blacklight/Fluorescent,Photograph,1,,,,,,,,,
64590,"Jim Durbin Drawer 107",2014-065191,,"Phragmatobia assimilans","Large Ruby Tiger Moth",Iowa,Linn,2014-08-22,,"Pleasant Creek State Recreation Area, Linn County",42.110327,-91.822988,"Jim Durbin",adult,Blacklight/Fluorescent,Pinned,1,,,,,,,,,
64692,,2014-065293,,"Phragmatobia lineata","Lined Ruby Tiger Moth",Iowa,Linn,2014-08-22,,"Pleasant Creek State Recreation Area, Linn County",42.110327,-91.822988,"Jim Durbin",adult,Blacklight/Fluorescent,Photograph,1,,,,,,,,,
64693,,2014-065294,,"Phragmatobia lineata","Lined Ruby Tiger Moth",Iowa,Linn,2014-08-22,,"Pleasant Creek State Recreation Area, Linn County",42.110327,-91.822988,"Jim Durbin",adult,Blacklight/Fluorescent,Photograph,1,,,,,,,,,
66191,,2014-066795,,"Phragmatobia assimilans","Large Ruby Tiger Moth",Iowa,Jefferson,2013-07-04,,"Near Fairfield",41.0503,-92.024,"Moni Hayne",adult,Blacklight/Fluorescent,Photograph,1,,,,,,,,,
67010,,2014-067615,,"Phragmatobia assimilans","Large Ruby Tiger Moth",Iowa,Winneshiek,2011-07-20,,"100 Acre Wood-x",0,0,"MJ Hatfield",adult,,Photograph,1,,,,,,,,,
67012,,2014-067617,,"Phragmatobia fuliginosa","Ruby Tiger Moth",Iowa,Winneshiek,2011-07-20,,"100 Acre Wood-x",0,0,"MJ Hatfield",adult,,Photograph,1,,,,,,,,,
67237,,2014-067842,,"Phragmatobia assimilans","Large Ruby Tiger Moth",Iowa,Winneshiek,2012-07-10,,"100 Acre Wood-x",0,0,"MJ Hatfield",adult,,Photograph,1,,,,,,,,,
67700,,2014-068305,,"Phragmatobia fuliginosa","Ruby Tiger Moth",Iowa,Winneshiek,2013-07-20,,"100 Acre Wood-x",0,0,"MJ Hatfield",adult,,Photograph,1,,,,,,,,,
67706,,2014-068311,,"Phragmatobia fuliginosa","Ruby Tiger Moth",Iowa,Winneshiek,2013-07-20,,"100 Acre Wood-x",0,0,"MJ Hatfield",adult,,Photograph,1,,,,,,,,,
69128,,2014-069735,,"Phragmatobia fuliginosa","Ruby Tiger Moth",Iowa,Kossuth,2014-07-13,,Algona,43.06998,-94.23295,"Matt Kenne",adult,,Sighting,1,,,,,,,,,
71138,,2014-071745,,"Phragmatobia lineata","Lined Ruby Tiger Moth",Iowa,Polk,2005-05-25,,"Puccoon Prairie",41.73528,-93.36417,"Keith Summerville",adult,,Sighting,1,,,,,,,,,
71139,,2014-071746,,"Phragmatobia lineata","Lined Ruby Tiger Moth",Iowa,Polk,2006-05-25,,"Puccoon Prairie",41.73528,-93.36417,"Keith Summerville",adult,,Sighting,2,,,,,,,,,
71140,,2014-071747,,"Phragmatobia lineata","Lined Ruby Tiger Moth",Iowa,Polk,2004-05-25,,"Synder Farm INHF",41.76675,-93.484171,"Keith Summerville",adult,,Sighting,1,,,,,,,,,
71141,,2014-071748,,"Phragmatobia lineata","Lined Ruby Tiger Moth",Iowa,Polk,2005-05-25,,"Synder Farm INHF",41.76675,-93.484171,"Keith Summerville",adult,,Sighting,12,,,,,,,,,
71142,,2014-071749,,"Phragmatobia lineata","Lined Ruby Tiger Moth",Iowa,Polk,2006-05-25,,"Synder Farm INHF",41.76675,-93.484171,"Keith Summerville",adult,,Sighting,1,,,,,,,,,
71143,,2014-071750,,"Phragmatobia lineata","Lined Ruby Tiger Moth",Iowa,Polk,2005-05-25,,"Chichaqua Bottoms Sandhill Prairie",41.77278,-93.385,"Keith Summerville",adult,,Sighting,7,,,,,,,,,
71144,,2014-071751,,"Phragmatobia lineata","Lined Ruby Tiger Moth",Iowa,Polk,2006-05-25,,"Chichaqua Bottoms Sandhill Prairie",41.77278,-93.385,"Keith Summerville",adult,,Sighting,2,,,,,,,,,
71145,,2014-071752,,"Phragmatobia lineata","Lined Ruby Tiger Moth",Iowa,Polk,2005-05-25,,"Paul Errington Marsh Wildlife Management Area",41.75611,-93.50556,"Keith Summerville",adult,,Sighting,4,,,,,,,,,
71146,,2014-071753,,"Phragmatobia lineata","Lined Ruby Tiger Moth",Iowa,Polk,2006-05-25,,"Paul Errington Marsh Wildlife Management Area",41.75611,-93.50556,"Keith Summerville",adult,,Sighting,4,,,,,,,,,
71147,,2014-071754,,"Phragmatobia lineata","Lined Ruby Tiger Moth",Iowa,Jasper,2005-05-25,,"Neal Smith National Wildlife Refuge",41.57639,-93.265,"Keith Summerville",adult,,Sighting,1,,,,,,,,,
71148,,2014-071755,,"Phragmatobia lineata","Lined Ruby Tiger Moth",Iowa,Polk,2005-05-25,,"Yellow Banks Park",41.547615,-93.47527,"Keith Summerville",adult,,Sighting,1,,,,,,,,,
71149,,2014-071756,,"Phragmatobia lineata","Lined Ruby Tiger Moth",Iowa,Jasper,2005-05-25,,"Neal Smith National Wildlife Refuge",41.54245,-93.2908,"Keith Summerville",adult,,Sighting,2,,,,,,,,,