ID,"Collection / Source","Catalog Number","Specify Number",Taxon,"Common Name",State,County,Date,Time,Locale,Latitude,Longitude,Collector,"Life Stage","Collection Method","Preparation Type",Count,Temperature,Humidity,"Dew Point",Wind,"Wind Direction","Barometric Pressure",Sky,"Moon Phase",Notes
41526,"Jim Durbin Drawer 013",2014-041903,SPM017532,"Eucosma umbrastriana",None,Iowa,Linn,2010-05-22,,"Wanatee County Park",42.01026,-91.57381,"Jim Durbin",adult,Blacklight/Fluorescent,Pinned,1,,,,,,,,,
41527,"Jim Durbin Drawer 013",2014-041904,SPM017574,"Eucosma umbrastriana",None,Iowa,Linn,2010-05-23,,"1460 Douglas Ct, Marion",42.040069,-91.590953,"Jim Durbin",adult,Blacklight/Fluorescent,Pinned,1,,,,,,,,,
41528,"Jim Durbin Drawer 013",2014-041905,SPM017609,"Eucosma umbrastriana",None,Iowa,Linn,2010-05-24,,"Wanatee County Park",42.01026,-91.57381,"Jim Durbin",adult,Blacklight/Fluorescent,Pinned,1,,,,,,,,,
41529,"Jim Durbin Drawer 013",2014-041906,SPM017627,"Eucosma umbrastriana",None,Iowa,Linn,2010-05-24,,"Wanatee County Park",42.01026,-91.57381,"Jim Durbin",adult,Blacklight/Fluorescent,Pinned,1,,,,,,,,,
41532,"Jim Durbin Drawer 013",2014-041909,SPM022062,"Eucosma umbrastriana",None,Iowa,Linn,2011-05-19,,"Rock Island Botanical State Preserve",42.02732,-91.72723,"Tom Jantscher",adult,,Pinned,1,,,,,,,,,
41533,,2014-041910,SPM024982,"Eucosma umbrastriana",None,Iowa,Warren,2011-05-18,,"Rolling Thunder Prairie State Preserve",41.2042,-93.656,"Frank Olsen",adult,,Pinned,1,,,,,,,,,"Located at Iowa State"
41534,"Jim Durbin Drawer 013",2014-041911,SPM026559,"Eucosma umbrastriana",None,Iowa,Lee,2012-05-04,,"Shimek State Forest, Croton Unit East",40.54693,-91.61435,"Tom Jantscher",adult,,Pinned,1,,,,,,,,,
41535,"Jim Durbin Drawer 013",2014-041912,SPM026560,"Eucosma umbrastriana",None,Iowa,Lee,2012-05-04,,"Shimek State Forest, Croton Unit East",40.54693,-91.61435,"Tom Jantscher",adult,,Pinned,1,,,,,,,,,
146385,,2016-011012,,"Eucosma umbrastriana",None,Iowa,Winneshiek,2014-06-14,,"Plymouth Rock-x",0,0,"MJ Hatfield",adult,,Photograph,1,,,,,,,,,
167213,,2016-031958,,"Eucosma umbrastriana",None,Iowa,Linn,2016-05-23,2030-2300,"Matsell Bridge Natural Area",42.131126,-91.388999,"Jim Durbin",adult,Blacklight/Florescent,Photograph,1,74,42,50,7,130,29.82,clear,Full,
167248,"Jim Durbin Drawer 013",2016-031993,,"Eucosma umbrastriana",None,Iowa,Linn,2016-05-23,2030-2300,"Matsell Bridge Natural Area",42.131126,-91.388999,"Jim Durbin",adult,Blacklight/Florescent,Pinned,1,74,42,50,7,130,29.82,clear,Full,
168022,,2016-032767,,"Eucosma umbrastriana",None,Iowa,Linn,2016-05-31,1030-2300,"Hitaga Sand Ridge Prairie Preserve",42.250957,-91.632098,"Jim Durbin",adult,Blacklight/Florescent,Photograph,1,66,100,65,0,0,29.89,cloudy,"30% visible","1030-2300. Rained for about 45 minutes."
170169,,2016-034914,,"Eucosma umbrastriana",None,Iowa,Decatur,2016-06-18,2100-2400,Redacted,Redacted,Redacted,"Jim Durbin",adult,Blacklight/Fluorescent,Photograph,1,77,43,53,0,0,30.18,clear,Full,
170176,,2016-034921,,"Eucosma umbrastriana",None,Iowa,Decatur,2016-06-18,2100-2400,Redacted,Redacted,Redacted,"Jim Durbin",adult,Blacklight/Fluorescent,Photograph,1,77,43,53,0,0,30.18,clear,Full,
192128,,2017-010089,,"Eucosma umbrastriana",None,Iowa,Linn,2017-06-03,2030-2330,"Wickiup Hill Outdoor Learning Area",42.087567,-91.767578,"Jim Durbin",adult,Blacklight/Fluorescent,Photograph,1,83,44,59,4,280,29.88,clear,"60% visible",
192242,,2017-010203,,"Eucosma umbrastriana",None,Iowa,Linn,2017-06-03,2030-2330,"Wickiup Hill Outdoor Learning Area",42.087567,-91.767578,"Jim Durbin",adult,Blacklight/Fluorescent,Photograph,1,83,44,59,4,280,29.88,clear,"60% visible",
209815,,2018-007972,,"Eucosma umbrastriana",None,Iowa,Jefferson,2016-06-26,,"Near Fairfield",41.0503,-92.024,"Moni Hayne",adult,Blacklight/Fluorescent,Photograph,1,,,,,,,,,
209816,,2018-007973,,"Eucosma umbrastriana",None,Iowa,Jefferson,2016-06-26,,"Near Fairfield",41.0503,-92.024,"Moni Hayne",adult,Blacklight/Fluorescent,Photograph,1,,,,,,,,,
211210,"Jim Durbin Drawer 013",2018-009367,,"Eucosma umbrastriana",None,Iowa,Linn,2018-05-30,"2045 - 2315","Hitaga Sand Ridge Prairie Preserve",42.250957,-91.632098,"Jim Durbin",adult,Blacklight/Fluorescent,Pinned,1,77,56,60,7,270,29.59,"partly cloudy",full,
211307,,2018-009464,,"Eucosma umbrastriana",None,Iowa,Linn,2018-05-30,"2045 - 2315","Hitaga Sand Ridge Prairie Preserve",42.25095,-91.63209,"Jim Durbin",adult,Blacklight/Fluorescent,Photograph,1,77,56,60,7,270,29.59,"partly cloudy",full,
211363,,2018-009520,,"Eucosma umbrastriana",None,Iowa,Linn,2018-05-30,"2045 - 2315","Hitaga Sand Ridge Prairie Preserve",42.25095,-91.63209,"Jim Durbin",adult,Blacklight/Fluorescent,Photograph,1,77,56,60,7,270,29.59,"partly cloudy",full,
211364,,2018-009521,,"Eucosma umbrastriana",None,Iowa,Linn,2018-05-30,"2045 - 2315","Hitaga Sand Ridge Prairie Preserve",42.25095,-91.63209,"Jim Durbin",adult,Blacklight/Fluorescent,Photograph,1,77,56,60,7,270,29.59,"partly cloudy",full,
211391,,2018-009548,,"Eucosma umbrastriana",None,Iowa,Linn,2018-05-30,"2045 - 2315","Hitaga Sand Ridge Prairie Preserve",42.25095,-91.63209,"Jim Durbin",adult,Blacklight/Fluorescent,Photograph,1,77,56,60,7,270,29.59,"partly cloudy",full,
215238,,2018-013394,,"Eucosma umbrastriana",None,Iowa,Winneshiek,2018-05-28,,"100 Acre Wood-x",0,0,"MJ Hatfield",adult,"Blacklight Trap",Photograph,1,,,,,,,,,
215258,,2018-013414,,"Eucosma umbrastriana",None,Iowa,Winneshiek,2018-05-28,,"100 Acre Wood-x",0,0,"MJ Hatfield",adult,"Blacklight Trap",Photograph,1,,,,,,,,,
215681,,2018-013837,,"Eucosma umbrastriana",None,Iowa,Winneshiek,2018-06-03,,"100 Acre Wood-x",0,0,"MJ Hatfield",adult,"Blacklight Trap",Photograph,1,,,,,,,,,
215743,,2018-013899,,"Eucosma umbrastriana",None,Iowa,Winneshiek,2018-06-06,,"100 Acre Wood-x",0,0,"MJ Hatfield",adult,"Blacklight Trap",Photograph,1,,,,,,,,,
223101,"Jim Durbin Drawer 013",2018-021255,,"Eucosma umbrastriana",None,Iowa,Winneshiek,2018-06-25,,"100 Acre Wood-x",0,0,"MJ Hatfield",adult,"Blacklight Trap",Pinned,1,,,,,,,,,
223310,,2018-021432,,"Eucosma umbrastriana",None,Iowa,Kossuth,2018-05-31,,"Union Slough National Wildlife Refuge",43.23852,-94.15303,"Matt Kenne",adult,,Sighting,1,,,,,,,,,
230185,,2019-004898,,"Eucosma umbrastriana",None,Iowa,Linn,2019-05-25,2100-2315,"Hitaga Sand Ridge Prairie Preserve",42.250957,-91.632098,"Jim Durbin",adult,Blacklight/Fluorescent,Photograph,1,75,68,64,1,180,29.82,clear,"80% visible",
230273,,2019-004986,,"Eucosma umbrastriana",None,Iowa,Linn,2019-05-25,2100-2315,"Hitaga Sand Ridge Prairie Preserve",42.250957,-91.632098,"Jim Durbin",adult,Blacklight/Fluorescent,Photograph,1,75,68,64,1,180,29.82,clear,"80% visible",
230275,,2019-004988,,"Eucosma umbrastriana",None,Iowa,Linn,2019-05-25,2100-2315,"Hitaga Sand Ridge Prairie Preserve",42.250957,-91.632098,"Jim Durbin",adult,Blacklight/Fluorescent,Photograph,1,75,68,64,1,180,29.82,clear,"80% visible",
230377,,2019-005611,,"Eucosma umbrastriana",None,Iowa,Linn,2019-05-30,"2100 - 2400","Hitaga Sand Ridge Prairie Preserve",42.250957,-91.632098,"Jim Durbin",adult,Blacklight/Fluorescent,Photograph,1,68,81,62,,,29.82,"partly cloidy","10% visible",
230387,,2019-005621,,"Eucosma umbrastriana",None,Iowa,Linn,2019-05-30,,"Hitaga Sand Ridge Prairie Preserve",42.250957,-91.632098,"Jim Durbin",adult,Blacklight/Fluorescent,Photograph,1,68,81,62,,,29.82,"partly cloidy","10% visible",
232857,,2019-007570,,"Eucosma umbrastriana",None,Iowa,Linn,2019-06-29,2100-2345,"Wickiup Hill Outdoor Learning Area",42.0876,-91.76787,"Jim Durbin",adult,Blacklight/Fluorescent,Photograph,1,85,69,74,0,180,29.84,Clear,"10% visible",
264948,,,,"Eucosma umbrastriana",None,Iowa,Linn,2020-05-23,21:02:48,"Pinicon Ridge Park",42.21848617,-91.53895602,"Jim Durbin",adult,Blacklight/Fluorescent,Photograph,1,68,72,62,2,330,29.71,clear,"new moon",
265586,,,,"Eucosma umbrastriana",None,Iowa,Linn,2020-06-05,22:21:10,"Hitaga Sand Ridge Prairie Preserve",42.25088607,-91.63212362,"Jim Durbin",adult,Blacklight/Fluorescent,Photograph,1,75,58,59,4,355,29.95,clear,Full,
265672,,,,"Eucosma umbrastriana",None,Iowa,Linn,2020-06-05,22:21:10,"Hitaga Sand Ridge Prairie Preserve",42.25088607,-91.63212362,"Jim Durbin",adult,Blacklight/Fluorescent,Photograph,1,75,58,59,4,355,29.95,clear,Full,
265742,,,,"Eucosma umbrastriana",None,Iowa,Linn,2020-06-05,22:21:10,"Hitaga Sand Ridge Prairie Preserve",42.25088607,-91.63212362,"Jim Durbin",adult,Blacklight/Fluorescent,Photograph,1,75,58,59,4,355,29.95,clear,Full,
265785,,,,"Eucosma umbrastriana",None,Iowa,Linn,2020-06-05,22:21:10,"Hitaga Sand Ridge Prairie Preserve",42.25088607,-91.63212362,"Jim Durbin",adult,Blacklight/Fluorescent,Photograph,1,75,58,59,4,355,29.95,clear,Full,
265790,,,,"Eucosma umbrastriana",None,Iowa,Linn,2020-06-05,22:21:10,"Hitaga Sand Ridge Prairie Preserve",42.25088607,-91.63212362,"Jim Durbin",adult,Blacklight/Fluorescent,Photograph,1,75,58,59,4,355,29.95,clear,Full,
265980,,,,"Eucosma umbrastriana",None,Iowa,Linn,2020-06-07,20:38:10,"Wickiup Hill Outdoor Learning Area",42.08736536,-91.76707659,"Jim Durbin",adult,Sighting,Photograph,1,81,49,60,4,170,29.77,clear,full,
267019,,,,"Eucosma umbrastriana",None,Iowa,Linn,2020-06-12,21:09:33,"Hitaga Sand Ridge Prairie Preserve",42.2508675,-91.63209427,"Jim Durbin",adult,Blacklight/Fluorescent,Photograph,1,76,48,55,0,0,30.17,"partly cloudy","80% visible",
267442,,,,"Eucosma umbrastriana",None,Iowa,Johnson,2020-05-26,,Redacted,Redacted,Redacted,"Mark Brown",adult,"Building Light",Photograph,1,,,,,,,,,
287962,,,,"Eucosma umbrastriana",None,Iowa,Linn,2021-05-24,21:33:51,"Matsell Bridge Natural Area",42.13218947,-91.38528806,"Jim Durbin",adult,Blacklight/Fluorescent,Photograph,1,76,77,68,4,190,30,Cloudy,"full moon",
288240,,,,"Eucosma umbrastriana",None,Iowa,Linn,2021-06-02,21:02:48,"Hitaga Sand Ridge Prairie Preserve",42.25092585,-91.63217796,"Jim Durbin",adult,Blacklight/Fluorescent,Photograph,1,65,69,55,,,29.91,clear,"6% visible",
290984,,,,"Eucosma umbrastriana",None,Iowa,Davis,2021-05-21,12:21:32,"Eldon Wildlife Management Area",40.88814479,-92.2523911,"Mark Brown",adult,Sighting,Photograph,1,,,,,,,,,
295752,,,,"Eucosma umbrastriana",None,Iowa,Davis,2021-05-21,12:21:32,"Eldon Wildlife Management Area",40.8887502,-92.25254462,"Mark Brown",adult,Sighting,Photograph,1,,,,,,,,,
309761,,,,"Eucosma umbrastriana",None,Iowa,Linn,2022-06-03,20:25:38,"Hitaga Sand Ridge Prairie Preserve",42.25096919,-91.63220559,"Jim Durbin",adult,Blacklight/Fluorescent,Photograph,1,66,32,36,0,0,29.96,clear,"10% visible",
334630,,,,"Eucosma umbrastriana",None,Iowa,Linn,2023-05-30,21:46:43,"Hitaga Sand Ridge Prairie Preserve",42.25073718,-91.63212197,"Jim Durbin",adult,Blacklight/Fluorescent,Photograph,1,71,57,55,0,0,29.91,"partly cloudy","90% visible",
334657,,,,"Eucosma umbrastriana",None,Iowa,Linn,2023-05-30,21:20:38,"Hitaga Sand Ridge Prairie Preserve",42.25073718,-91.63212197,"Jim Durbin",adult,Blacklight/Fluorescent,Photograph,1,71,57,55,0,0,29.91,"partly cloudy","90% visible",
