ID,"Collection / Source","Catalog Number","Specify Number",Taxon,"Common Name",State,County,Date,Time,Locale,Latitude,Longitude,Collector,"Life Stage","Collection Method","Preparation Type",Count,Temperature,Humidity,"Dew Point",Wind,"Wind Direction","Barometric Pressure",Sky,"Moon Phase",Notes
43959,"Jim Durbin Drawer 040",2014-044336,SPM029396,"Pyrausta inveterascalis",None,Iowa,Linn,2012-06-26,,"Wanatee County Park",42.0094,-91.56623,"Jim Durbin",adult,Blacklight/Fluorescent,Pinned,1,,,,,,,,,
44439,"Jim Durbin Drawer 040",2014-044816,SPM008807,"Pyrausta inveterascalis",None,Iowa,Clayton,2007-06-27,,"Howard Creek Fish & Wildlife Service",42.94542,-91.36382,"Jim Durbin",adult,Blacklight/Fluorescent,Pinned,1,,,,,,,,,
44440,"Jim Durbin Drawer 040",2014-044817,SPM011920,"Pyrausta inveterascalis",None,Iowa,Linn,2008-08-05,,"Rock Island Botanical State Preserve",42.02732,-91.72723,"Jim Durbin",adult,Blacklight/Fluorescent,Pinned,1,,,,,,,,,
44441,"Jim Durbin Drawer 040",2014-044818,SPM014280,"Pyrausta inveterascalis",None,Iowa,Linn,2009-07-01,,"Wickiup Hill Outdoor Learning Area",42.08398,-91.7651,"Jim Durbin",adult,Blacklight/Fluorescent,Pinned,1,,,,,,,,,
44442,"Jim Durbin Drawer 040",2014-044819,SPM014361,"Pyrausta inveterascalis",None,Iowa,Linn,2009-07-11,,"Wickiup Hill Outdoor Learning Area",42.08398,-91.7651,"Jim Durbin",adult,Blacklight/Fluorescent,Pinned,1,,,,,,,,,
44443,"Jim Durbin Drawer 040",2014-044820,SPM014362,"Pyrausta inveterascalis",None,Iowa,Linn,2009-07-11,,"Wickiup Hill Outdoor Learning Area",42.08398,-91.7651,"Jim Durbin",adult,Blacklight/Fluorescent,Pinned,1,,,,,,,,,
44444,"Jim Durbin Drawer 040",2014-044821,SPM018259,"Pyrausta inveterascalis",None,Iowa,Linn,2010-06-29,,"Wickiup Hill Outdoor Learning Area",42.08398,-91.7651,"Jim Durbin",adult,Blacklight/Fluorescent,Pinned,1,,,,,,,,,
44445,"Jim Durbin Drawer 040",2014-044822,SPM018601,"Pyrausta inveterascalis",None,Iowa,Linn,2010-07-24,,"Wanatee County Park",42.01026,-91.57381,"Jim Durbin",adult,Blacklight/Fluorescent,Pinned,1,,,,,,,,,
44516,"Jim Durbin Drawer 040",2014-044893,SPM034649,"Pyrausta inveterascalis",None,Iowa,Guthrie,2013-07-12,,"Whiterock Conservancy",41.80725,-94.64085,"Jim Durbin",adult,Blacklight/Fluorescent,Pinned,1,,,,,,,,,
64562,"Jim Durbin Drawer 040",2014-065163,,"Pyrausta inveterascalis",None,Iowa,Linn,2014-08-22,,"Pleasant Creek State Recreation Area, Linn County",42.110327,-91.822988,"Jim Durbin",adult,Blacklight/Fluorescent,Pinned,1,,,,,,,,,
67518,,2014-068123,,"Pyrausta inveterascalis",None,Iowa,Winneshiek,2012-06-18,,"100 Acre Wood-x",0,0,"MJ Hatfield",adult,,Photograph,1,,,,,,,,,
67710,,2014-068315,,"Pyrausta inveterascalis",None,Iowa,Winneshiek,2013-07-13,,"100 Acre Wood-x",0,0,"MJ Hatfield",adult,,Photograph,1,,,,,,,,,
127849,,2015-018439,,"Pyrausta inveterascalis",None,Iowa,Jackson,2015-07-10,2100-2330,"Prairie Creek Recreation Area",42.061696,-90.638097,"Jim Durbin",adult,Blacklight/Fluorescent,Photograph,1,75,80,60,6,120,30.14,clear,"20% visible",
128342,,2015-018932,,"Pyrausta inveterascalis",None,Iowa,Linn,2015-07-19,"2100 - 2300","Indian Creek Nature Center",41.968932,-91.586884,"Jim Durbin",adult,Blacklight/Fluorescent,Photograph,1,79,62,64,0,0,29.87,clear,"5 % visible",
132446,"Paul Martsching Collection",2015-023037,,"Pyrausta inveterascalis",None,Iowa,Story,2015-09-05,,"Ames, Paul",42.02064,-93.623952,"Paul Martsching",adult,"Building Light",Pinned,1,,,,,,,,,
172670,,2016-037415,,"Pyrausta inveterascalis",None,Iowa,Linn,2016-07-24,,"Hitaga Sand Ridge Prairie Preserve",42.250957,-91.632098,"Jim Durbin",adult,Blacklight/Fluorescent,Photograph,1,77,70,66,,300,29.9,"partly cloudy","90% visible",
172722,,2016-037467,,"Pyrausta inveterascalis",None,Iowa,Linn,2016-07-24,,"Hitaga Sand Ridge Prairie Preserve",42.250957,-91.632098,"Jim Durbin",adult,Blacklight/Fluorescent,Photograph,1,77,70,66,,300,29.9,"partly cloudy","90% visible",
212281,,2018-010437,,"Pyrausta inveterascalis",None,Iowa,Linn,2018-06-15,2100-2315,"Wickiup Hill Outdoor Learning Area",42.087352,-91.767107,"Jim Durbin",adult,Blacklight/Florescent,Photograph,1,84,70,73,3,120,29.79,"partly cloudy","0 % visible",
212303,,2018-010459,,"Pyrausta inveterascalis",None,Iowa,Linn,2018-06-15,2100-2315,"Wickiup Hill Outdoor Learning Area",42.087352,-91.767107,"Jim Durbin",adult,Blacklight/Florescent,Photograph,1,84,70,73,3,120,29.79,"partly cloudy","0 % visible",
213244,,2018-011400,,"Pyrausta inveterascalis",None,Iowa,Linn,2018-06-27,2100-2330,"Matsell Bridge Natural Area",42.132148,-91.385221,"Jim Durbin",adult,Blacklight/Fluorescent,Photograph,1,80,59,64,0,0,29.77,"partly cloudy",Full,"extremely heavy dew"
213915,,2018-012071,,"Pyrausta inveterascalis",None,Iowa,Linn,2018-07-03,2100-2330,"Wickiup Hill Outdoor Learning Area",42.087352,-91.767107,"Jim Durbin",adult,Blacklight/Fluorescent,Photograph,1,82,68,70,4,90,29.96,Clear,"80 % visible",
213928,,2018-012084,,"Pyrausta inveterascalis",None,Iowa,Linn,2018-07-03,2100-2330,"Wickiup Hill Outdoor Learning Area",42.087352,-91.767107,"Jim Durbin",adult,Blacklight/Fluorescent,Photograph,1,82,68,70,4,90,29.96,Clear,"80 % visible",
214010,,2018-012166,,"Pyrausta inveterascalis",None,Iowa,Linn,2018-07-03,2100-2330,"Wickiup Hill Outdoor Learning Area",42.087352,-91.767107,"Jim Durbin",adult,Blacklight/Fluorescent,Photograph,1,82,68,70,4,90,29.96,Clear,"80 % visible",
216770,,2018-014926,,"Pyrausta inveterascalis",None,Iowa,Winneshiek,2018-06-22,,"100 Acre Wood-x",0,0,"MJ Hatfield",adult,"Blacklight Trap",Photograph,1,,,,,,,,,
216961,,2018-015117,,"Pyrausta inveterascalis",None,Iowa,Winneshiek,2018-06-26,,"100 Acre Wood-x",0,0,"MJ Hatfield",adult,"Blacklight Trap",Photograph,1,,,,,,,,,
217820,,2018-015976,,"Pyrausta inveterascalis",None,Iowa,Winneshiek,2018-07-14,,"100 Acre Wood-x",0,0,"MJ Hatfield",adult,"Blacklight Trap",Photograph,1,,,,,,,,,
222812,"Paul Martsching Collection",2018-020966,,"Pyrausta inveterascalis",None,Iowa,Story,2018-08-18,,"Ames, Paul",42.02064,-93.623952,"Paul Martsching",adult,"Building Light",Pinned,1,,,,,,,,,
233256,,2019-008049,,"Pyrausta inveterascalis",None,Iowa,Linn,2019-07-04,2100-2315,"Wickiup Hill Outdoor Learning Area",42.086576,-91.766717,"Jim Durbin",adult,Blacklight/Fluorescent,Photograph,1,82,66,69,2,170,29.75,clear,new,
289798,,,,"Pyrausta inveterascalis",None,Iowa,Linn,2021-07-03,22:53:58,"Pinicon Ridge Park",42.21096962,-91.54429747,"Jim Durbin",adult,Blacklight/Fluorescent,Photograph,1,79,57,63,3,190,29.9,clear,"50% visible",
289802,,,,"Pyrausta inveterascalis",None,Iowa,Linn,2021-07-03,22:53:44,"Pinicon Ridge Park",42.21096962,-91.54429747,"Jim Durbin",adult,Blacklight/Fluorescent,Photograph,1,79,57,63,3,190,29.9,clear,"50% visible",
311376,,,,"Pyrausta inveterascalis",None,Iowa,Linn,2022-07-02,22:10:28,"Wanatee County Park",42.01013441,-91.56662262,"Jim Durbin",adult,Blacklight/Fluorescent,Photograph,1,72,61,58,3,190,30.02,clear,"10% moon",
311379,,,,"Pyrausta inveterascalis",None,Iowa,Linn,2022-07-02,22:09:50,"Wanatee County Park",42.01013441,-91.56662262,"Jim Durbin",adult,Blacklight/Fluorescent,Photograph,1,72,61,58,3,190,30.02,clear,"10% moon",
311382,,,,"Pyrausta inveterascalis",None,Iowa,Linn,2022-07-02,22:09:06,"Wanatee County Park",42.01013441,-91.56662262,"Jim Durbin",adult,Blacklight/Fluorescent,Photograph,1,72,61,58,3,190,30.02,clear,"10% moon",
311393,,,,"Pyrausta inveterascalis",None,Iowa,Linn,2022-07-02,22:06:48,"Wanatee County Park",42.01013441,-91.56662262,"Jim Durbin",adult,Blacklight/Fluorescent,Photograph,1,72,61,58,3,190,30.02,clear,"10% moon",
335339,,,,"Pyrausta inveterascalis",None,Iowa,Linn,2023-06-17,23:02:17,"Wanatee County Park",42.010114365,-91.566550498333,"Jim Durbin",adult,Blacklight/Fluorescent,Photograph,1,75,54,57,2,90,29.84,c;ear,"no moon",
336236,,,,"Pyrausta inveterascalis",None,Iowa,Linn,2023-06-29,22:55:52,"Indian Creek Nature Center",41.96608977,-91.58982624,"Jim Durbin",adult,Blacklight/Fluorescent,Photograph,1,76,92,74,0,330,29.88,hazy,"50% visible",
336758,,,,"Pyrausta inveterascalis",None,Iowa,Linn,2023-07-02,22:52:00,"1460 Douglas Ct, Marion",42.040098668333,-91.590915611667,"Jim Durbin",adult,Blacklight/Fluorescent,Photograph,1,,,,,,,,,
337190,,,,"Pyrausta inveterascalis",None,Iowa,Linn,2023-07-08,22:15:27,"Palisades Kepler State Park",41.90829802,-91.50242489,"Jim Durbin",adult,Blacklight/Fluorescent,Photograph,1,73,55,53,7,330,29.89,clear,"80% visible",
358770,,,,"Pyrausta inveterascalis",None,Iowa,Winneshiek,2018-06-24,,"Roslien Woods",43.3244,-91.8216,"Lena Schmitt",adult,,,1,,,,,,,,,"Data from Kirk Larsen, Luther College"
367638,,,,"Pyrausta inveterascalis",None,Iowa,Linn,2024-06-21,22:05:28,"Palisades Kepler State Park",41.908421415,-91.502343391667,"Jim Durbin",adult,Blacklight/Fluorescent,Photograph,1,81,70,77,4,180,29.99,"partly cloudy","full moon",
