ID,"Collection / Source","Catalog Number","Specify Number",Taxon,"Common Name",State,County,Date,Time,Locale,Latitude,Longitude,Collector,"Life Stage","Collection Method","Preparation Type",Count,Temperature,Humidity,"Dew Point",Wind,"Wind Direction","Barometric Pressure",Sky,"Moon Phase",Notes
23,"Frank Olsen Drawer 13",2014-000023,SPM010384,"Ennomos magnaria","Maple Spanworm",Iowa,Linn,2007-09-16,,"Pinicon Ridge Park",42.21188,-91.54753,"Frank Olsen",adult,,Pinned,1,,,,,,,,,"Located at Iowa State"
24,"Frank Olsen Drawer 13",2014-000024,SPM010385,"Ennomos magnaria","Maple Spanworm",Iowa,Linn,2007-10-03,,"Pleasant Creek State Recreation Area, Linn County",42.11952,-91.81215,"Frank Olsen",adult,,Pinned,1,,,,,,,,,"Located at Iowa State"
25,"Frank Olsen Drawer 13",2014-000025,SPM010386,"Ennomos magnaria","Maple Spanworm",Iowa,Allamakee,2007-08-01,,"Yellow River State Forest",43.1676,-91.254,"Frank Olsen",adult,,Pinned,1,,,,,,,,,"Located at Iowa State"
582,"Jim Durbin Drawer 063",2014-000582,SPM001059,"Ennomos magnaria","Maple Spanworm",Iowa,Linn,2004-09-04,,"Wickiup Hill Outdoor Learning Area",42.08398,-91.7651,"Jim Durbin",adult,Blacklight/Fluorescent,Pinned,1,,,,,,,,,
593,"Jim Durbin Drawer 063",2014-000593,SPM001060,"Ennomos magnaria","Maple Spanworm",Iowa,Linn,2004-09-04,,"Wickiup Hill Outdoor Learning Area",42.08398,-91.7651,"Jim Durbin",adult,Blacklight/Fluorescent,Pinned,1,,,,,,,,,
1023,"Frank Olsen Drawer 13",2014-001023,SPM010384,"Ennomos magnaria","Maple Spanworm",Iowa,Linn,2007-09-16,,"Pinicon Ridge Park",42.21188,-91.54753,"Frank Olsen",adult,,Pinned,1,,,,,,,,,"Located at Iowa State"
1024,"Frank Olsen Drawer 13",2014-001024,SPM010385,"Ennomos magnaria","Maple Spanworm",Iowa,Linn,2007-10-03,,"Pleasant Creek State Recreation Area, Linn County",42.11952,-91.81215,"Frank Olsen",adult,,Pinned,1,,,,,,,,,"Located at Iowa State"
1025,"Frank Olsen Drawer 13",2014-001025,SPM010386,"Ennomos magnaria","Maple Spanworm",Iowa,Allamakee,2007-08-01,,"Yellow River State Forest",43.1676,-91.254,"Frank Olsen",adult,,Pinned,1,,,,,,,,,"Located at Iowa State"
25248,,2014-025595,SPM000020,"Ennomos magnaria","Maple Spanworm",Iowa,Linn,2003-07-23,,"Wanatee County Park",42.0094,-91.56623,"Jim Durbin",adult,Blacklight/Fluorescent,Sighting,1,,,,,,,,,
25249,"Jim Durbin Drawer 063",2014-025596,SPM001099,"Ennomos magnaria","Maple Spanworm",Iowa,"Van Buren",2004-09-11,,"Shimek State Forest, Farmington Unit",40.64802,-91.7254,"Jim Durbin",adult,Blacklight/Fluorescent,Pinned,1,,,,,,,,,
25250,"Jim Durbin Drawer 063",2014-025597,SPM001100,"Ennomos magnaria","Maple Spanworm",Iowa,"Van Buren",2004-09-11,,"Shimek State Forest, Farmington Unit",40.64802,-91.7254,"Jim Durbin",adult,Blacklight/Fluorescent,Pinned,1,,,,,,,,,
25251,"Frank Olsen Drawer 13",2014-025598,SPM002235,"Ennomos magnaria","Maple Spanworm",Iowa,"Van Buren",2004-09-11,,"Shimek State Forest, Farmington Unit",40.64802,-91.7254,"Frank Olsen",adult,,Pinned,1,,,,,,,,,"Located at Iowa State"
25252,"Frank Olsen Drawer 13",2014-025599,SPM002236,"Ennomos magnaria","Maple Spanworm",Iowa,"Van Buren",2004-09-11,,"Shimek State Forest, Farmington Unit",40.64802,-91.7254,"Frank Olsen",adult,,Pinned,1,,,,,,,,,"Located at Iowa State"
25253,"Frank Olsen Drawer 13",2014-025600,SPM002237,"Ennomos magnaria","Maple Spanworm",Iowa,"Van Buren",2004-09-11,,"Shimek State Forest, Farmington Unit",40.64802,-91.7254,"Frank Olsen",adult,,Pinned,1,,,,,,,,,"Located at Iowa State"
25254,"Jim Durbin Drawer 063",2014-025601,SPM002238,"Ennomos magnaria","Maple Spanworm",Iowa,"Van Buren",2004-09-30,,"Shimek State Forest, Farmington Unit",40.64802,-91.7254,"Frank Olsen",adult,Blacklight/Florescent,Pinned,1,,,,,,,,,
25255,"Jim Durbin Drawer 063",2014-025602,SPM002239,"Ennomos magnaria","Maple Spanworm",Iowa,"Van Buren",2004-09-30,,"Shimek State Forest, Farmington Unit",40.64802,-91.7254,"Frank Olsen",adult,Blacklight/Florescent,Pinned,1,,,,,,,,,
25256,"Frank Olsen Drawer 13",2014-025603,SPM002240,"Ennomos magnaria","Maple Spanworm",Iowa,"Van Buren",2004-09-30,,"Shimek State Forest, Farmington Unit",40.64802,-91.7254,"Frank Olsen",adult,,Pinned,1,,,,,,,,,"Located at Iowa State"
25257,"Frank Olsen Drawer 13",2014-025604,SPM002241,"Ennomos magnaria","Maple Spanworm",Iowa,"Van Buren",2004-09-30,,"Shimek State Forest, Farmington Unit",40.64802,-91.7254,"Frank Olsen",adult,,Pinned,1,,,,,,,,,"Located at Iowa State"
25258,"Frank Olsen Drawer 13",2014-025605,SPM002242,"Ennomos magnaria","Maple Spanworm",Iowa,"Van Buren",2003-08-02,,"Shimek State Forest, Farmington Unit",40.64802,-91.7254,"Frank Olsen",adult,,Pinned,1,,,,,,,,,"Located at Iowa State"
25259,"Frank Olsen Drawer 13",2014-025606,SPM002243,"Ennomos magnaria","Maple Spanworm",Iowa,Linn,2003-09-05,,"Wanatee County Park",42.00994,-91.57749,"Frank Olsen",adult,,Pinned,1,,,,,,,,,"Located at Iowa State"
25260,"Frank Olsen Drawer 13",2014-025607,SPM002244,"Ennomos magnaria","Maple Spanworm",Iowa,Linn,2004-10-06,,"Wickiup Hill Outdoor Learning Area",42.08398,-91.7651,"Frank Olsen",adult,,Pinned,1,,,,,,,,,"Located at Iowa State"
25261,"Jim Durbin Drawer 063",2014-025608,SPM005314,"Ennomos magnaria","Maple Spanworm",Iowa,Lee,2005-10-01,,"Shimek State Forest, Donnellson Unit",40.64833,-91.68057,"Jim Durbin",adult,Blacklight/Fluorescent,Pinned,1,,,,,,,,,
25262,"Frank Olsen Drawer 13",2014-025609,SPM005389,"Ennomos magnaria","Maple Spanworm",Iowa,"Van Buren",2005-10-18,,"Shimek State Forest, Farmington Unit",40.64802,-91.7254,"Frank Olsen",adult,,Pinned,1,,,,,,,,,"Located at Iowa State"
25263,"Frank Olsen Drawer 13",2014-025610,SPM005390,"Ennomos magnaria","Maple Spanworm",Iowa,"Van Buren",2005-10-18,,"Shimek State Forest, Farmington Unit",40.64802,-91.7254,"Frank Olsen",adult,,Pinned,1,,,,,,,,,"Located at Iowa State"
25264,"Frank Olsen Drawer 13",2014-025611,SPM005391,"Ennomos magnaria","Maple Spanworm",Iowa,Dubuque,2005-10-03,,"Mines of Spain State Recreational Area",42.4453,-90.62293,"Frank Olsen",adult,,Pinned,1,,,,,,,,,"Located at Iowa State"
25265,"Frank Olsen Drawer 13",2014-025612,SPM005392,"Ennomos magnaria","Maple Spanworm",Iowa,Fremont,2005-09-11,,"Waubonsie State Park",40.676,-95.689,"Frank Olsen",adult,,Pinned,1,,,,,,,,,"Located at Iowa State"
25266,"Jim Durbin Drawer 063",2014-025613,SPM006963,"Ennomos magnaria","Maple Spanworm",Iowa,Linn,2006-08-01,,"Pleasant Creek State Recreation Area, Linn County",42.11952,-91.81215,"Jim Durbin",adult,Blacklight/Fluorescent,Pinned,1,,,,,,,,,
25267,"Jim Durbin Drawer 063",2014-025614,SPM006975,"Ennomos magnaria","Maple Spanworm",Iowa,Linn,2006-08-01,,"Pleasant Creek State Recreation Area, Linn County",42.11952,-91.81215,"Jim Durbin",adult,Blacklight/Fluorescent,Pinned,1,,,,,,,,,
25268,"Frank Olsen Drawer 13",2014-025615,SPM007390,"Ennomos magnaria","Maple Spanworm",Iowa,Linn,2006-10-03,,"Wickiup Hill Outdoor Learning Area",42.08398,-91.7651,"Frank Olsen",adult,,Pinned,1,,,,,,,,,"Located at Iowa State"
25269,"Jim Durbin Drawer 063",2014-025616,SPM010247,"Ennomos magnaria","Maple Spanworm",Kentucky,Ohio,2007-10-16,,"Leon's Farm, Ohio County",37.42033,-86.77023,"Jim Durbin",adult,Blacklight/Fluorescent,Pinned,1,,,,,,,,,
25270,"Frank Olsen Drawer 13",2014-025617,SPM012671,"Ennomos magnaria","Maple Spanworm",Iowa,Allamakee,2008-09-25,,"Yellow River State Forest",43.1676,-91.254,"Frank Olsen",adult,,Pinned,1,,,,,,,,,"Located at Iowa State"
25271,"Frank Olsen Drawer 13",2014-025618,SPM012672,"Ennomos magnaria","Maple Spanworm",Iowa,Linn,2008-09-19,,"Pleasant Creek State Recreation Area, Linn County",42.11952,-91.81215,"Frank Olsen",adult,,Pinned,1,,,,,,,,,"Located at Iowa State"
25272,,2014-025619,SPM015921,"Ennomos magnaria","Maple Spanworm",Iowa,Winneshiek,1995-10-04,,"Anderson Prairie, Decorah",43.315099,-91.800701,"Brian McCornack",adult,,Pinned,1,,,,,,,,,
25273,,2014-025620,SPM015925,"Ennomos magnaria","Maple Spanworm",Iowa,Winneshiek,1995-10-04,,"Anderson Prairie, Decorah",43.315099,-91.800701,"Brian McCornack",adult,,Pinned,1,,,,,,,,,
25274,,2014-025621,SPM015929,"Ennomos magnaria","Maple Spanworm",Iowa,Winneshiek,1997-09-23,,"Luther College",43.31333,-91.80306,"Simon Tenvelde",adult,,Pinned,1,,,,,,,,,
25275,"Frank Olsen Drawer 13",2014-025622,SPM016299,"Ennomos magnaria","Maple Spanworm",Iowa,Clayton,2009-09-22,,"Osborne Outdoor Education Center Park",42.79303,-91.4432,"Frank Olsen",adult,,Pinned,1,,,,,,,,,"Located at Iowa State"
25276,"Frank Olsen Drawer 13",2014-025623,SPM016300,"Ennomos magnaria","Maple Spanworm",Iowa,Warren,2009-08-02,,"Woodland Mounds State Preserve",41.34618,-93.4281,"Frank Olsen",adult,,Pinned,1,,,,,,,,,"Located at Iowa State"
25277,,2014-025624,SPM016626,"Ennomos magnaria","Maple Spanworm",Iowa,Story,2007-07-23,,"Green Hills Retirement Community",42,-93.65,"Lloyd Crim",adult,,Pinned,1,,,,,,,,,
25278,"Paul Martsching Collection",2014-025625,SPM016989,"Ennomos magnaria","Maple Spanworm",Iowa,Story,2006-09-28,,"Ames, Paul",42.02064,-93.623952,"Paul Martsching",adult,"Building Light",Pinned,1,,,,,,,,,
25279,,2014-025626,SPM017066,"Ennomos magnaria","Maple Spanworm",Iowa,Winneshiek,1993-10-07,,"Luther College",43.31333,-91.80306,"Kirk Larsen",adult,,Pinned,1,,,,,,,,,
25280,,2014-025627,SPM017067,"Ennomos magnaria","Maple Spanworm",Iowa,Winneshiek,1993-10-07,,"Luther College",43.31333,-91.80306,"Kirk Larsen",adult,,Pinned,1,,,,,,,,,
25281,,2014-025628,SPM024797,"Ennomos magnaria","Maple Spanworm",Iowa,Winneshiek,2010-08-19,,"100 Acre Wood-x",0,0,"MJ Hatfield",adult,,Photograph,1,,,,,,,,,
25282,"Frank Olsen Drawer 13",2014-025629,SPM037229,"Ennomos magnaria","Maple Spanworm",Iowa,Fremont,2013-09-02,,"Waubonsie State Park",40.676,-95.689,"Frank Olsen",adult,,Pinned,1,,,,,,,,,"Located at Iowa State"
25283,"Frank Olsen Drawer 13",2014-025630,SPM037230,"Ennomos magnaria","Maple Spanworm",Iowa,Fremont,2013-09-02,,"Waubonsie State Park",40.676,-95.689,"Frank Olsen",adult,,Pinned,1,,,,,,,,,"Located at Iowa State"
25284,,2014-025631,SPM037523,"Ennomos magnaria","Maple Spanworm",Iowa,Kossuth,2013-09-04,,Algona,43.06998,-94.23295,"Matt Kenne",adult,,Sighting,1,,,,,,,,,
108066,,2014-108813,,"Ennomos magnaria","Maple Spanworm",Iowa,Clarke,2014-09-26,,"Red Fern Timber",40.98317,-93.75317,"Frank Olsen",adult,,Photograph,1,,,,,,,,,
111103,,2015-001659,,"Ennomos magnaria","Maple Spanworm",Iowa,Polk,2013-09-05,,Redacted,Redacted,Redacted,"Aaron Brees",adult,,Sighting,1,,,,,,,,,
132659,,2015-023253,,"Ennomos magnaria","Maple Spanworm",Iowa,Decatur,2015-10-12,,Redacted,Redacted,Redacted,"Sibylla Brown",adult,,Sighting,1,,,,,,,,,
132852,,2015-023446,,"Ennomos magnaria","Maple Spanworm",Iowa,Pottawattamie,2015-10-08,,"Hitchcock Nature Center",41.41733,-95.85388,"Loren & Babs Padelford",adult,,Photograph,1,,,,,,,,,
133100,"Frank Olsen Drawer 13",2015-023694,,"Ennomos magnaria","Maple Spanworm",Iowa,Fremont,2015-08-31,,"Waubonsie State Park",40.676,-95.689,"Frank Olsen",adult,,Pinned,1,,,,,,,,,"Located at Iowa State"
133895,"Paul Martsching Collection",2015-024489,,"Ennomos magnaria","Maple Spanworm",Iowa,Story,2003-08-19,,"Ames, Paul",42.02064,-93.623952,"Paul Martsching",adult,"Building Light",Pinned,1,,,,,,,,,
133896,"Paul Martsching Collection",2015-024490,,"Ennomos magnaria","Maple Spanworm",Iowa,Story,2003-08-22,,"Ames, Paul",42.02064,-93.623952,"Paul Martsching",adult,"Building Light",Pinned,1,,,,,,,,,
133897,"Paul Martsching Collection",2015-024491,,"Ennomos magnaria","Maple Spanworm",Iowa,Story,2004-09-15,,"Ames, Paul",42.02064,-93.623952,"Paul Martsching",adult,"Building Light",Pinned,1,,,,,,,,,
133898,"Paul Martsching Collection",2015-024492,,"Ennomos magnaria","Maple Spanworm",Iowa,Story,2003-09-15,,"Ames, Paul",42.02064,-93.623952,"Paul Martsching",adult,"Building Light",Pinned,1,,,,,,,,,
133899,"Paul Martsching Collection",2015-024493,,"Ennomos magnaria","Maple Spanworm",Iowa,Story,2004-09-15,,"Ames, Paul",42.02064,-93.623952,"Paul Martsching",adult,"Building Light",Pinned,1,,,,,,,,,
133900,"Paul Martsching Collection",2015-024494,,"Ennomos magnaria","Maple Spanworm",Iowa,Story,2004-09-25,,"Ames, Paul",42.02064,-93.623952,"Paul Martsching",adult,"Building Light",Pinned,1,,,,,,,,,
134166,"Paul Martsching Collection",2015-024760,,"Ennomos magnaria","Maple Spanworm",Iowa,Story,2004-09-27,,"Ames, Paul",42.02064,-93.623952,"Paul Martsching",adult,"Building Light",Pinned,1,,,,,,,,,
147821,,2016-012448,,"Ennomos magnaria","Maple Spanworm",Iowa,Winneshiek,2015-08-14,,"100 Acre Wood-x",0,0,"MJ Hatfield",adult,,Photograph,1,,,,,,,,,
173726,,2016-038476,,"Ennomos magnaria","Maple Spanworm",Iowa,Decatur,2016-07-24,,Redacted,Redacted,Redacted,"Logan Crees",adult,,Photograph,1,,,,,,,,,
180189,"Jim Durbin Drawer 063",2016-044939,,"Ennomos magnaria","Maple Spanworm",Iowa,Fremont,2016-09-01,,"Waubonsie State Park",40.676,-95.689,"Frank Olsen",adult,Blacklight/Florescent,Pinned,1,,,,,,,,,
182544,,2017-000505,,"Ennomos magnaria","Maple Spanworm",Iowa,Johnson,2016-10-11,,Redacted,Redacted,Redacted,"Mark Brown",adult,,Photograph,1,,,,,,,,,
200507,,2017-018439,,"Ennomos magnaria","Maple Spanworm",Iowa,Pottawattamie,2017-07-29,,"Hitchcock Nature Center",41.41733,-95.85388,"Loren & Babs Padelford",adult,,Photograph,1,,,,,,,,,
203317,,2018-001465,,"Ennomos magnaria","Maple Spanworm",Iowa,Story,2003-08-19,,"Ames, Paul",42.02064,-93.62395,"Paul Martsching",adult,"Building Light",Sighting,1,,,,,,,,,
203318,,2018-001466,,"Ennomos magnaria","Maple Spanworm",Iowa,Story,2003-09-15,,"Ames, Paul",42.02064,-93.62395,"Paul Martsching",adult,"Building Light",Sighting,1,,,,,,,,,
203319,,2018-001467,,"Ennomos magnaria","Maple Spanworm",Iowa,Story,2004-09-15,,"Ames, Paul",42.02064,-93.62395,"Paul Martsching",adult,"Building Light",Sighting,7,,,,,,,,,
203320,,2018-001468,,"Ennomos magnaria","Maple Spanworm",Iowa,Story,2005-09-15,,"Ames, Paul",42.02064,-93.62395,"Paul Martsching",adult,"Building Light",Sighting,4,,,,,,,,,
203321,,2018-001469,,"Ennomos magnaria","Maple Spanworm",Iowa,Story,2006-08-29,,"Ames, Paul",42.02064,-93.62395,"Paul Martsching",adult,"Building Light",Sighting,1,,,,,,,,,
203322,,2018-001470,,"Ennomos magnaria","Maple Spanworm",Iowa,Story,2006-10-06,,"Ames, Paul",42.02064,-93.62395,"Paul Martsching",adult,"Building Light",Sighting,2,,,,,,,,,
203323,,2018-001471,,"Ennomos magnaria","Maple Spanworm",Iowa,Story,2007-09-29,,"Ames, Paul",42.02064,-93.62395,"Paul Martsching",adult,"Building Light",Sighting,1,,,,,,,,,
203324,,2018-001472,,"Ennomos magnaria","Maple Spanworm",Iowa,Story,2007-10-07,,"Ames, Paul",42.02064,-93.62395,"Paul Martsching",adult,"Building Light",Sighting,4,,,,,,,,,
203325,,2018-001473,,"Ennomos magnaria","Maple Spanworm",Iowa,Story,2008-09-29,,"Ames, Paul",42.02064,-93.62395,"Paul Martsching",adult,"Building Light",Sighting,1,,,,,,,,,
203326,,2018-001474,,"Ennomos magnaria","Maple Spanworm",Iowa,Story,2008-10-09,,"Ames, Paul",42.02064,-93.62395,"Paul Martsching",adult,"Building Light",Sighting,1,,,,,,,,,
203327,,2018-001475,,"Ennomos magnaria","Maple Spanworm",Iowa,Story,2009-08-04,,"Ames, Paul",42.02064,-93.62395,"Paul Martsching",adult,"Building Light",Sighting,1,,,,,,,,,
203328,,2018-001476,,"Ennomos magnaria","Maple Spanworm",Iowa,Story,2009-10-28,,"Ames, Paul",42.02064,-93.62395,"Paul Martsching",adult,"Building Light",Sighting,1,,,,,,,,,
203329,,2018-001477,,"Ennomos magnaria","Maple Spanworm",Iowa,Story,2010-10-08,,"Ames, Paul",42.02064,-93.62395,"Paul Martsching",adult,"Building Light",Sighting,1,,,,,,,,,
217781,,2018-015937,,"Ennomos magnaria","Maple Spanworm",Iowa,Winneshiek,2018-07-13,,"100 Acre Wood-x",0,0,"MJ Hatfield",adult,"Blacklight Trap",Photograph,1,,,,,,,,,
220776,,2018-018930,,"Ennomos magnaria","Maple Spanworm",Iowa,Winneshiek,2018-08-11,,"100 Acre Wood-x",0,0,"MJ Hatfield",adult,"Blacklight Trap",Photograph,1,,,,,,,,,
220812,,2018-018966,,"Ennomos magnaria","Maple Spanworm",Iowa,Winneshiek,2018-08-11,,"100 Acre Wood-x",0,0,"MJ Hatfield",adult,"Blacklight Trap",Photograph,1,,,,,,,,,
220820,,2018-018974,,"Ennomos magnaria","Maple Spanworm",Iowa,Winneshiek,2018-08-11,,"100 Acre Wood-x",0,0,"MJ Hatfield",adult,"Blacklight Trap",Photograph,1,,,,,,,,,
220902,,2018-019056,,"Ennomos magnaria","Maple Spanworm",Iowa,Winneshiek,2018-08-14,,"100 Acre Wood-x",0,0,"MJ Hatfield",adult,"Blacklight Trap",Photograph,1,,,,,,,,,
221292,,2018-019446,,"Ennomos magnaria","Maple Spanworm",Iowa,Winneshiek,2018-08-26,,"100 Acre Wood-x",0,0,"MJ Hatfield",adult,"Blacklight Trap",Photograph,1,,,,,,,,,
221326,,2018-019480,,"Ennomos magnaria","Maple Spanworm",Iowa,Winneshiek,2018-08-27,,"100 Acre Wood-x",0,0,"MJ Hatfield",adult,"Blacklight Trap",Photograph,1,,,,,,,,,
221470,,2018-019624,,"Ennomos magnaria","Maple Spanworm",Iowa,Winneshiek,2018-09-01,,"100 Acre Wood-x",0,0,"MJ Hatfield",adult,"Blacklight Trap",Photograph,1,,,,,,,,,
221889,,2018-020043,,"Ennomos magnaria","Maple Spanworm",Iowa,Winneshiek,2018-09-18,,"100 Acre Wood-x",0,0,"MJ Hatfield",adult,"Blacklight Trap",Photograph,1,,,,,,,,,
221955,,2018-020109,,"Ennomos magnaria","Maple Spanworm",Iowa,Winneshiek,2018-09-22,,"100 Acre Wood-x",0,0,"MJ Hatfield",adult,"Blacklight Trap",Photograph,1,,,,,,,,,
223230,,2018-021384,,"Ennomos magnaria","Maple Spanworm",Iowa,Johnson,2018-10-04,,"MacBride Nature Recreation Area",41.786729,-91.568057,"Mark Brown",adult,,Sighting,1,,,,,,,,,
224585,,2018-022726,,"Ennomos magnaria","Maple Spanworm",Iowa,Appanoose,2018-10-06,,"Sundown Lake Recreation Area",40.830089,-92.747939,"Eric Liskey",adult,,Photograph,1,,,,,,,,,
227617,,2019-002337,,"Ennomos magnaria","Maple Spanworm",Iowa,Johnson,2018-10-04,,"MacBride Nature Recreation Area",41.786729,-91.568057,"Mark Brown",adult,,Photograph,1,,,,,,,,,
236590,,,,"Ennomos magnaria","Maple Spanworm",Iowa,Linn,2019-08-19,2030-2300,"Wickiup Hill Outdoor Learning Area",42.087352,-91.767107,"Jim Durbin",adult,Blacklight/Fluorescent,Photograph,1,74,81,68,2,90,29.88,"partly cloudy","90% visible",
238341,,,,"Ennomos magnaria","Maple Spanworm",Iowa,Johnson,2019-09-02,,"MacBride Nature Recreation Area",41.786729,-91.568057,"Mark Brown",adult,"Building Light",Photograph,1,,,,,,,,,
241458,,,,"Ennomos magnaria","Maple Spanworm",Iowa,Johnson,2019-10-09,,"MacBride Nature Recreation Area",41.786729,-91.568057,"Mark Brown",adult,"Building Light",Photograph,1,,,,,,,,,
241471,,,,"Ennomos magnaria","Maple Spanworm",Iowa,Johnson,2019-10-02,,"MacBride Nature Recreation Area",41.786729,-91.568057,"Mark Brown",adult,"Building Light",Photograph,1,,,,,,,,,
241513,,,,"Ennomos magnaria","Maple Spanworm",Iowa,Johnson,2019-09-30,,"MacBride Nature Recreation Area",41.786729,-91.568057,"Mark Brown",adult,"Building Light",Photograph,1,,,,,,,,,
241518,,,,"Ennomos magnaria","Maple Spanworm",Iowa,Johnson,2019-09-27,,"MacBride Nature Recreation Area",41.786729,-91.568057,"Mark Brown",adult,"Building Light",Photograph,1,,,,,,,,,
241526,,,,"Ennomos magnaria","Maple Spanworm",Iowa,Johnson,2019-09-27,,"MacBride Nature Recreation Area",41.786729,-91.568057,"Mark Brown",adult,"Building Light",Photograph,1,,,,,,,,,
270142,,,,"Ennomos magnaria","Maple Spanworm",Iowa,Johnson,2020-07-26,6:27:28,"MacBride Nature Recreation Area",41.78672811,-91.56848566,"Mark Brown",adult,Sighting,Photograph,1,,,,,,,,,
274906,,,,"Ennomos magnaria","Maple Spanworm",Iowa,Johnson,2020-06-07,,"Atherton Wetland",41.843951,-91.558414,"Mark Brown",adult,"Building Light",Photograph,2,,,,,,,,,
315042,,,,"Ennomos magnaria","Maple Spanworm",Iowa,Webster,2022-06-11,,"Fort Dodge Nature Trail",42.534867,-94.163621,"Mark Brown",adult,Sighting,Photograph,1,,,,,,,,,
352856,,,,"Ennomos magnaria","Maple Spanworm",Iowa,Winneshiek,1995-10-04,,"Anderson Prairie, Decorah",43.315099,-91.800701,"Brian McCornack",adult,,,1,,,,,,,,,"Data from Kirk Larsen, Luther College"
354612,,,,"Ennomos magnaria","Maple Spanworm",Iowa,Winneshiek,1995-09-14,,Decorah-x,43.30333,-91.78556,"Brian McCornack",adult,,,1,,,,,,,,,"Data from Kirk Larsen, Luther College"
357516,,,,"Ennomos magnaria","Maple Spanworm",Iowa,Winneshiek,1997-09-23,,"Luther College",43.313333,-91.803889,"Simon TenVelde",adult,,,1,,,,,,,,,"Data from Kirk Larsen, Luther College"
357517,,,,"Ennomos magnaria","Maple Spanworm",Iowa,Winneshiek,1993-10-07,,"Luther College",43.313333,-91.803889,"Kirk J. Larsen",adult,,,1,,,,,,,,,"Data from Kirk Larsen, Luther College"
357518,,,,"Ennomos magnaria","Maple Spanworm",Iowa,Winneshiek,1993-10-07,,"Luther College",43.313333,-91.803889,"Kirk J. Larsen",adult,,,1,,,,,,,,,"Data from Kirk Larsen, Luther College"
