ID,"Collection / Source","Catalog Number","Specify Number",Taxon,"Common Name",State,County,Date,Time,Locale,Latitude,Longitude,Collector,"Life Stage","Collection Method","Preparation Type",Count,Temperature,Humidity,"Dew Point",Wind,"Wind Direction","Barometric Pressure",Sky,"Moon Phase",Notes
312,"Frank Olsen Drawer 43",2014-000312,SPM010646,"Costaconvexa centrostrigaria","The Bent-line Carpet",Iowa,Floyd,2007-05-27,,"Wentland Woods",43.14467,-92.71167,"Frank Olsen",adult,,Pinned,1,,,,,,,,,"Located at Iowa State"
313,"Frank Olsen Drawer 43",2014-000313,SPM010647,"Costaconvexa centrostrigaria","The Bent-line Carpet",Iowa,Allamakee,2007-10-20,,"Yellow River State Forest",43.1676,-91.254,"Frank Olsen",adult,,Pinned,1,,,,,,,,,"Located at Iowa State"
314,"Frank Olsen Drawer 43",2014-000314,SPM010648,"Costaconvexa centrostrigaria","The Bent-line Carpet",Iowa,Allamakee,2007-10-20,,"Yellow River State Forest",43.1676,-91.254,"Frank Olsen",adult,,Pinned,1,,,,,,,,,"Located at Iowa State"
316,"Frank Olsen Drawer 43",2014-000316,SPM010649,"Costaconvexa centrostrigaria","The Bent-line Carpet",Iowa,Allamakee,2007-10-20,,"Yellow River State Forest",43.1676,-91.254,"Frank Olsen",adult,,Pinned,1,,,,,,,,,"Located at Iowa State"
317,"Frank Olsen Drawer 43",2014-000317,SPM010650,"Costaconvexa centrostrigaria","The Bent-line Carpet",Iowa,Allamakee,2007-10-20,,"Yellow River State Forest",43.1676,-91.254,"Frank Olsen",adult,,Pinned,1,,,,,,,,,"Located at Iowa State"
318,,2014-000318,SPM010651,"Costaconvexa centrostrigaria","The Bent-line Carpet",Iowa,Allamakee,2007-10-20,,"Yellow River State Forest",43.1676,-91.254,"Frank Olsen",adult,,Pinned,1,,,,,,,,,"Located at Iowa State"
319,"Frank Olsen Drawer 43",2014-000319,SPM010652,"Costaconvexa centrostrigaria","The Bent-line Carpet",Iowa,Allamakee,2007-08-01,,"Yellow River State Forest",43.1676,-91.254,"Frank Olsen",adult,,Pinned,1,,,,,,,,,"Located at Iowa State"
320,"Frank Olsen Drawer 43",2014-000320,SPM010653,"Costaconvexa centrostrigaria","The Bent-line Carpet",Iowa,Linn,2007-10-03,,"Pleasant Creek State Recreation Area, Linn County",42.11952,-91.81215,"Frank Olsen",adult,,Pinned,1,,,,,,,,,"Located at Iowa State"
367,,2014-000367,SPM010695,"Costaconvexa centrostrigaria","The Bent-line Carpet",Iowa,Linn,2007-07-23,,"Rock Island Botanical State Preserve",42.02732,-91.72723,"Frank Olsen",adult,,Pinned,1,,,,,,,,,"Located at Iowa State"
634,"Jim Durbin Drawer 073",2014-000634,SPM011003,"Costaconvexa centrostrigaria","The Bent-line Carpet",Iowa,Johnson,2008-07-12,,"Sugar Bottom Recreational Area",41.759443,-91.562986,"Jim Durbin",adult,Blacklight/Fluorescent,Pinned,1,,,,,,,,,
807,"Jim Durbin Drawer 073",2014-000807,SPM011158,"Costaconvexa centrostrigaria","The Bent-line Carpet",Iowa,Clayton,2008-07-15,,"Bixby State Preserve",42.67502,-91.3988,"Jim Durbin",adult,Blacklight/Fluorescent,Pinned,1,,,,,,,,,
812,"Jim Durbin Drawer 073",2014-000812,SPM011163,"Costaconvexa centrostrigaria","The Bent-line Carpet",Iowa,Clayton,2008-07-15,,"Bixby State Preserve",42.67502,-91.3988,"Jim Durbin",adult,Blacklight/Fluorescent,Pinned,1,,,,,,,,,
845,"Jim Durbin Drawer 073",2014-000845,SPM011193,"Costaconvexa centrostrigaria","The Bent-line Carpet",Iowa,Clayton,2008-07-15,,"Bixby State Preserve",42.67502,-91.3988,"Jim Durbin",adult,Blacklight/Fluorescent,Pinned,1,,,,,,,,,
854,"Jim Durbin Drawer 073",2014-000854,SPM011201,"Costaconvexa centrostrigaria","The Bent-line Carpet",Iowa,Clayton,2008-07-15,,"Bixby State Preserve",42.67502,-91.3988,"Jim Durbin",adult,Blacklight/Fluorescent,Pinned,1,,,,,,,,,
862,"Jim Durbin Drawer 073",2014-000862,SPM011208,"Costaconvexa centrostrigaria","The Bent-line Carpet",Iowa,Clayton,2008-07-15,,"Bixby State Preserve",42.67502,-91.3988,"Jim Durbin",adult,Blacklight/Fluorescent,Pinned,1,,,,,,,,,
903,"Jim Durbin Drawer 073",2014-000903,SPM011245,"Costaconvexa centrostrigaria","The Bent-line Carpet",Iowa,Allamakee,2008-07-16,,"Yellow River State Forest",43.1676,-91.254,"Jim Durbin",adult,Blacklight/Fluorescent,Pinned,1,,,,,,,,,
2644,,2014-002925,,"Costaconvexa centrostrigaria","The Bent-line Carpet",Iowa,Benton,2012-05-10,,"Benton County",41.9971518,-91.885107," BAMONA",adult,,Sighting,1,,,,,,,,,
10750,,2014-011032,,"Costaconvexa centrostrigaria","The Bent-line Carpet",Iowa,Linn,2014-08-08,2030-2300DST,"Pleasant Creek State Recreation Area, Linn County",42.110327,-91.822988,"Jim Durbin",adult,Blacklight/Fluorescent,Photograph,1,72-69,79,62,Calm,,30.04,Clear,,
11532,,2014-011814,SPM039767,"Costaconvexa centrostrigaria","The Bent-line Carpet",Iowa,Linn,2014-05-22,,"Matsell Bridge Natural Area",42.13131,-91.38886,"Jim Durbin",adult,Blacklight/Fluorescent,Photograph,1,,,,,,,,,
12128,,2014-012410,SPM042185,"Costaconvexa centrostrigaria","The Bent-line Carpet",Kentucky,Ohio,2014-07-02,,Redacted,Redacted,Redacted,"Jim Durbin",adult,Blacklight/Fluorescent,Photograph,1,,,,,,,,,
22005,"Frank Olsen Drawer 43",2014-022342,SPM002796,"Costaconvexa centrostrigaria","The Bent-line Carpet",Iowa,Linn,2003-06-28,,"Wanatee County Park",42.00994,-91.57749,"Frank Olsen",adult,,Pinned,1,,,,,,,,,"Located at Iowa State"
22006,"Frank Olsen Drawer 43",2014-022343,SPM002797,"Costaconvexa centrostrigaria","The Bent-line Carpet",Iowa,Linn,2004-07-14,,"Wickiup Hill Outdoor Learning Area",42.08398,-91.7651,"Frank Olsen",adult,,Pinned,1,,,,,,,,,"Located at Iowa State"
22007,"Frank Olsen Drawer 43",2014-022344,SPM002798,"Costaconvexa centrostrigaria","The Bent-line Carpet",Iowa,Linn,2004-10-21,,"Wickiup Hill Outdoor Learning Area",42.08398,-91.7651,"Frank Olsen",adult,,Pinned,1,,,,,,,,,"Located at Iowa State"
22008,,2014-022345,SPM003613,"Costaconvexa centrostrigaria","The Bent-line Carpet",Iowa,Jasper,2003-05-15,,"Neal Smith National Wildlife Refuge",41.5678,-93.2675,"Keith Summerville",adult,,Pinned,1,,,,,,,,,
22009,"Jim Durbin Drawer 073",2014-022346,SPM004682,"Costaconvexa centrostrigaria","The Bent-line Carpet",Iowa,Linn,2005-06-26,,"Wanatee County Park",42.0094,-91.56623,"Jim Durbin",adult,Blacklight/Fluorescent,Pinned,1,,,,,,,,,
22010,"Frank Olsen Drawer 43",2014-022347,SPM005570,"Costaconvexa centrostrigaria","The Bent-line Carpet",Iowa,Linn,2005-09-27,,"Palisades Kepler State Park",41.90833,-91.50238,"Frank Olsen",adult,,Pinned,1,,,,,,,,,"Located at Iowa State"
22011,"Frank Olsen Drawer 43",2014-022348,SPM005647,"Costaconvexa centrostrigaria","The Bent-line Carpet",Iowa,Linn,2005-10-17,,"Wanatee County Park",42.00994,-91.57749,"Frank Olsen",adult,,Pinned,1,,,,,,,,,"Located at Iowa State"
22012,"Frank Olsen Drawer 43",2014-022349,SPM005648,"Costaconvexa centrostrigaria","The Bent-line Carpet",Iowa,Linn,2005-10-17,,"Wanatee County Park",42.00994,-91.57749,"Frank Olsen",adult,,Pinned,1,,,,,,,,,"Located at Iowa State"
22013,"Frank Olsen Drawer 43",2014-022350,SPM007792,"Costaconvexa centrostrigaria","The Bent-line Carpet",Iowa,Linn,2006-10-07,,"Palisades Kepler State Park",41.90833,-91.50238,"Frank Olsen",adult,,Pinned,1,,,,,,,,,"Located at Iowa State"
22014,"Frank Olsen Drawer 43",2014-022351,SPM007793,"Costaconvexa centrostrigaria","The Bent-line Carpet",Iowa,Floyd,2006-08-22,,"Rockford Fossil & Prairie Park Preserve",43.04778,-92.97113,"Frank Olsen",adult,,Pinned,1,,,,,,,,,"Located at Iowa State"
22015,,2014-022352,SPM008120,"Costaconvexa centrostrigaria","The Bent-line Carpet",Iowa,Jasper,2005-05-25,,"Neal Smith National Wildlife Refuge",41.54245,-93.2908,"Keith Summerville",adult,,Pinned,1,,,,,,,,,
22016,"Jim Durbin Drawer 073",2014-022353,SPM008479,"Costaconvexa centrostrigaria","The Bent-line Carpet",Iowa,Linn,2007-05-14,,"Wickiup Hill Outdoor Learning Area",42.08398,-91.7651,"Jim Durbin",adult,Blacklight/Fluorescent,Pinned,1,,,,,,,,,
22017,"Jim Durbin Drawer 073",2014-022354,SPM008879,"Costaconvexa centrostrigaria","The Bent-line Carpet",Iowa,Linn,2007-07-07,,"Pinicon Ridge Park",42.21188,-91.54753,"Jim Durbin",adult,Blacklight/Fluorescent,Pinned,1,,,,,,,,,
22018,"Jim Durbin Drawer 073",2014-022355,SPM009149,"Costaconvexa centrostrigaria","The Bent-line Carpet",Kentucky,Daviess,2007-05-03,,"Panther Creek Park",37.71538,-87.21873,"Jim Durbin",adult,"Building Light",Pinned,1,,,,,,,,,
22019,"Jim Durbin Drawer 073",2014-022356,SPM009789,"Costaconvexa centrostrigaria","The Bent-line Carpet",Iowa,Linn,2007-07-26,,"J. Harold Ennis County Park",41.898532,-91.482884,"Jim Durbin",adult,Blacklight/Fluorescent,Pinned,1,,,,,,,,,
22020,"Jim Durbin Drawer 073",2014-022357,SPM009891,"Costaconvexa centrostrigaria","The Bent-line Carpet",Iowa,Linn,2007-06-17,,"1460 Douglas Ct, Marion",42.040069,-91.590953,"Jim Durbin",adult,Blacklight/Fluorescent,Pinned,1,,,,,,,,,
22021,"Jim Durbin Drawer 073",2014-022358,SPM010002,"Costaconvexa centrostrigaria","The Bent-line Carpet",Iowa,Linn,2007-06-17,,"1460 Douglas Ct, Marion",42.040069,-91.590953,"Jim Durbin",adult,Blacklight/Fluorescent,Pinned,1,,,,,,,,,
22022,"Jim Durbin Drawer 073",2014-022359,SPM010190,"Costaconvexa centrostrigaria","The Bent-line Carpet",Iowa,Jones,2007-10-20,,"Central Park, Jones County ",42.11042,-91.1381,"Jim Durbin",adult,Blacklight/Fluorescent,Pinned,1,,,,,,,,,
22023,"Jim Durbin Drawer 073",2014-022360,SPM011531,"Costaconvexa centrostrigaria","The Bent-line Carpet",Iowa,Linn,2008-07-27,,Redacted,Redacted,Redacted,"Jim Durbin",adult,Blacklight/Fluorescent,Pinned,1,,,,,,,,,
22024,"Jim Durbin Drawer 073",2014-022361,SPM011548,"Costaconvexa centrostrigaria","The Bent-line Carpet",Iowa,Linn,2008-07-27,,Redacted,Redacted,Redacted,"Jim Durbin",adult,Blacklight/Fluorescent,Pinned,1,,,,,,,,,
22025,"Jim Durbin Drawer 073",2014-022362,SPM011961,"Costaconvexa centrostrigaria","The Bent-line Carpet",Iowa,Linn,2008-07-30,,Redacted,Redacted,Redacted,"Jim Durbin",adult,Blacklight/Fluorescent,Pinned,1,,,,,,,,,
22026,"Jim Durbin Drawer 073",2014-022363,SPM012448,"Costaconvexa centrostrigaria","The Bent-line Carpet",Iowa,Linn,2008-07-30,,Redacted,Redacted,Redacted,"Jim Durbin",adult,Blacklight/Fluorescent,Pinned,1,,,,,,,,,
22027,"Frank Olsen Drawer 43",2014-022364,SPM013104,"Costaconvexa centrostrigaria","The Bent-line Carpet",Iowa,Scott,2008-05-16,,"Cameron Woods State Preserve",41.655092,-90.735144,"Frank Olsen",adult,,Pinned,1,,,,,,,,,"Located at Iowa State"
22028,"Frank Olsen Drawer 43",2014-022365,SPM013105,"Costaconvexa centrostrigaria","The Bent-line Carpet",Iowa,Allamakee,2008-09-25,,"Yellow River State Forest",43.1676,-91.254,"Frank Olsen",adult,,Pinned,1,,,,,,,,,"Located at Iowa State"
22029,"Frank Olsen Drawer 43",2014-022366,SPM013106,"Costaconvexa centrostrigaria","The Bent-line Carpet",Iowa,Muscatine,2008-10-11,,"Wildcat Den State Park",41.4705,-90.88228,"Frank Olsen",adult,,Pinned,1,,,,,,,,,"Located at Iowa State"
22030,"Frank Olsen Drawer 43",2014-022367,SPM013107,"Costaconvexa centrostrigaria","The Bent-line Carpet",Iowa,Linn,2008-07-23,,"Hanging Bog State Preserve",42.0333365,-91.767999,"Frank Olsen",adult,,Pinned,1,,,,,,,,,"Located at Iowa State"
22031,"Frank Olsen Drawer 43",2014-022368,SPM013108,"Costaconvexa centrostrigaria","The Bent-line Carpet",Iowa,Linn,2008-04-16,,"J. Harold Ennis County Park",41.898488,-91.483092,"Frank Olsen",adult,,Pinned,1,,,,,,,,,"Located at Iowa State"
22032,"Frank Olsen Drawer 43",2014-022369,SPM013109,"Costaconvexa centrostrigaria","The Bent-line Carpet",Iowa,Scott,2008-05-16,,"Cameron Woods State Preserve",41.655092,-90.735144,"Frank Olsen",adult,,Pinned,1,,,,,,,,,"Located at Iowa State"
22033,"Jim Durbin Drawer 073",2014-022370,SPM013380,"Costaconvexa centrostrigaria","The Bent-line Carpet",Iowa,Story,2006-09-30,,"2505 Tullamore Lane, Ames",42.088653,-93.578813,"MJ Hatfield",adult,,Pinned,1,,,,,,,,,
22034,"Jim Durbin Drawer 073",2014-022371,SPM013441,"Costaconvexa centrostrigaria","The Bent-line Carpet",Iowa,Story,2007-06-25,,"McFarland Park",42.092878,-93.571,"MJ Hatfield",adult,,Pinned,1,,,,,,,,,
22035,,2014-022372,SPM013685,"Costaconvexa centrostrigaria","The Bent-line Carpet",Iowa,Guthrie,2006-08-22,,"Whiterock Conservancy",41.8201,-94.64768,"Elizabeth Hill",adult,,Pinned,1,,,,,,,,,
22037,"Jim Durbin Drawer 073",2014-022374,SPM015165,"Costaconvexa centrostrigaria","The Bent-line Carpet",Iowa,Fremont,2009-08-09,,"Waubonsie State Park",40.676,-95.689,"Jim Durbin",adult,Blacklight/Fluorescent,Pinned,1,,,,,,,,,
22038,"Jim Durbin Drawer 073",2014-022375,SPM015585,"Costaconvexa centrostrigaria","The Bent-line Carpet",Iowa,Decatur,2009-08-06,,"Nine Eagles State Park",40.59835,-93.76385,"Jim Durbin",adult,Blacklight/Fluorescent,Pinned,1,,,,,,,,,
22039,"Jim Durbin Drawer 073",2014-022376,SPM017441,"Costaconvexa centrostrigaria","The Bent-line Carpet",Iowa,Linn,2010-05-15,,"Wanatee County Park",42.00994,-91.57749,"Jim Durbin",adult,Blacklight/Fluorescent,Pinned,1,,,,,,,,,
22040,"Jim Durbin Drawer 073",2014-022377,SPM017442,"Costaconvexa centrostrigaria","The Bent-line Carpet",Iowa,Linn,2010-05-15,,"Wanatee County Park",42.00994,-91.57749,"Jim Durbin",adult,Blacklight/Fluorescent,Pinned,1,,,,,,,,,
22041,"Jim Durbin Drawer 073",2014-022378,SPM017482,"Costaconvexa centrostrigaria","The Bent-line Carpet",Iowa,Linn,2010-05-18,,"Wanatee County Park",42.01026,-91.57381,"Jim Durbin",adult,Blacklight/Fluorescent,Pinned,1,,,,,,,,,
22042,"Jim Durbin Drawer 073",2014-022379,SPM017493,"Costaconvexa centrostrigaria","The Bent-line Carpet",Iowa,Linn,2010-05-18,,"Wanatee County Park",42.01026,-91.57381,"Jim Durbin",adult,Blacklight/Fluorescent,Pinned,1,,,,,,,,,
22043,"Jim Durbin Drawer 073",2014-022380,SPM017495,"Costaconvexa centrostrigaria","The Bent-line Carpet",Iowa,Linn,2010-05-18,,"Wanatee County Park",42.01026,-91.57381,"Jim Durbin",adult,Blacklight/Fluorescent,Pinned,1,,,,,,,,,
22044,"Jim Durbin Drawer 073",2014-022381,SPM017498,"Costaconvexa centrostrigaria","The Bent-line Carpet",Iowa,Linn,2010-05-18,,"Wanatee County Park",42.01026,-91.57381,"Jim Durbin",adult,Blacklight/Fluorescent,Pinned,1,,,,,,,,,
22045,"Jim Durbin Drawer 073",2014-022382,SPM017554,"Costaconvexa centrostrigaria","The Bent-line Carpet",Iowa,Linn,2010-05-22,,"Wanatee County Park",42.01026,-91.57381,"Jim Durbin",adult,Blacklight/Fluorescent,Pinned,1,,,,,,,,,
22046,"Jim Durbin Drawer 073",2014-022383,SPM017581,"Costaconvexa centrostrigaria","The Bent-line Carpet",Iowa,Linn,2010-05-23,,"1460 Douglas Ct, Marion",42.040069,-91.590953,"Jim Durbin",adult,Blacklight/Fluorescent,Pinned,1,,,,,,,,,
22047,"Jim Durbin Drawer 073",2014-022384,SPM017590,"Costaconvexa centrostrigaria","The Bent-line Carpet",Iowa,Linn,2010-05-23,,"1460 Douglas Ct, Marion",42.040069,-91.590953,"Jim Durbin",adult,Blacklight/Fluorescent,Pinned,1,,,,,,,,,
22048,"Jim Durbin Drawer 073",2014-022385,SPM017657,"Costaconvexa centrostrigaria","The Bent-line Carpet",Iowa,Linn,2010-05-26,,"Wanatee County Park",42.01026,-91.57381,"Jim Durbin",adult,Blacklight/Fluorescent,Pinned,1,,,,,,,,,
22049,"Jim Durbin Drawer 073",2014-022386,SPM017840,"Costaconvexa centrostrigaria","The Bent-line Carpet",Kentucky,Ohio,2010-06-16,,"Leon's Farm, Ohio County",37.42033,-86.77023,"Jim Durbin",adult,Blacklight/Fluorescent,Pinned,1,,,,,,,,,
22050,"Jim Durbin Drawer 073",2014-022387,SPM017847,"Costaconvexa centrostrigaria","The Bent-line Carpet",Kentucky,Ohio,2010-06-16,,"Leon's Farm, Ohio County",37.42033,-86.77023,"Jim Durbin",adult,Blacklight/Fluorescent,Pinned,1,,,,,,,,,
22051,"Jim Durbin Drawer 073",2014-022388,SPM017995,"Costaconvexa centrostrigaria","The Bent-line Carpet",Iowa,Linn,2010-06-22,,"Wanatee County Park",42.0094,-91.56623,"Jim Durbin",adult,Blacklight/Fluorescent,Pinned,1,,,,,,,,,
22052,"Jim Durbin Drawer 073",2014-022389,SPM018086,"Costaconvexa centrostrigaria","The Bent-line Carpet",Iowa,Allamakee,2010-06-25,,"Yellow River State Forest",43.13753,-91.22503,"Jim Durbin",adult,Blacklight/Fluorescent,Pinned,1,,,,,,,,,
22053,,2014-022390,SPM018346,"Costaconvexa centrostrigaria","The Bent-line Carpet",Iowa,Jasper,2010-06-18,,"Conard Environmental Research Area",41.70093,-92.77365,"John Balaban",adult,,Pinned,1,,,,,,,,,
22054,"Jim Durbin Drawer 073",2014-022391,SPM018363,"Costaconvexa centrostrigaria","The Bent-line Carpet",Iowa,Linn,2010-07-09,,"1460 Douglas Ct, Marion",42.040069,-91.590953,"Jim Durbin",adult,Blacklight/Fluorescent,Pinned,1,,,,,,,,,
22055,"Jim Durbin Drawer 073",2014-022392,SPM018555,"Costaconvexa centrostrigaria","The Bent-line Carpet",Iowa,Allamakee,2010-07-12,,"Yellow River State Forest",43.1676,-91.254,"Jim Durbin",adult,Blacklight/Fluorescent,Pinned,1,,,,,,,,,
22056,"Jim Durbin Drawer 073",2014-022393,SPM018936,"Costaconvexa centrostrigaria","The Bent-line Carpet",Iowa,"Palo Alto",2010-08-06,,"Lost Island County Park",43.17582,-94.89189,"Jim Durbin",adult,Blacklight/Fluorescent,Pinned,1,,,,,,,,,
22057,"Jim Durbin Drawer 073",2014-022394,SPM018937,"Costaconvexa centrostrigaria","The Bent-line Carpet",Iowa,"Palo Alto",2010-08-06,,"Lost Island County Park",43.17582,-94.89189,"Jim Durbin",adult,Blacklight/Fluorescent,Pinned,1,,,,,,,,,
22058,"Frank Olsen Drawer 43",2014-022395,SPM020357,"Costaconvexa centrostrigaria","The Bent-line Carpet",Iowa,Clarke,2010-07-25,,"Red Fern Timber",40.98317,-93.75317,"Frank Olsen",adult,,Pinned,1,,,,,,,,,"Located at Iowa State"
22059,"Frank Olsen Drawer 43",2014-022396,SPM020358,"Costaconvexa centrostrigaria","The Bent-line Carpet",Iowa,Linn,2010-11-10,,"Matsell Bridge Natural Area",42.13131,-91.38886,"Frank Olsen",adult,,Pinned,1,,,,,,,,,"Located at Iowa State"
22060,"Frank Olsen Drawer 43",2014-022397,SPM020359,"Costaconvexa centrostrigaria","The Bent-line Carpet",Iowa,Linn,2010-08-01,,"Pinicon Ridge Park",42.21188,-91.54753,"Frank Olsen",adult,,Pinned,1,,,,,,,,,"Located at Iowa State"
22061,"Frank Olsen Drawer 43",2014-022398,SPM020520,"Costaconvexa centrostrigaria","The Bent-line Carpet",Iowa,Linn,2010-10-22,,"Rock Island Botanical State Preserve",42.02732,-91.72723,"Frank Olsen",adult,,Pinned,1,,,,,,,,,"Located at Iowa State"
22062,"Frank Olsen Drawer 43",2014-022399,SPM020521,"Costaconvexa centrostrigaria","The Bent-line Carpet",Iowa,Linn,2010-10-16,,"Pleasant Creek State Recreation Area, Linn County",42.11952,-91.81215,"Frank Olsen",adult,,Pinned,1,,,,,,,,,"Located at Iowa State"
22063,"Frank Olsen Drawer 43",2014-022400,SPM020522,"Costaconvexa centrostrigaria","The Bent-line Carpet",Iowa,Allamakee,2010-06-25,,"Yellow River State Forest",43.1676,-91.254,"Frank Olsen",adult,,Pinned,1,,,,,,,,,"Located at Iowa State"
22064,"Frank Olsen Drawer 43",2014-022401,SPM020523,"Costaconvexa centrostrigaria","The Bent-line Carpet",Iowa,Linn,2010-05-06,,"Rock Island Botanical State Preserve",42.02732,-91.72723,"Frank Olsen",adult,,Pinned,1,,,,,,,,,"Located at Iowa State"
22065,"Frank Olsen Drawer 43",2014-022402,SPM020524,"Costaconvexa centrostrigaria","The Bent-line Carpet",Iowa,Hardin,2010-05-19,,"Pine Lake State Park",42.37364,-93.06681,"Frank Olsen",adult,,Pinned,1,,,,,,,,,"Located at Iowa State"
22066,"Jim Durbin Drawer 073",2014-022403,SPM021477,"Costaconvexa centrostrigaria","The Bent-line Carpet",Iowa,Linn,2011-05-30,,"Wanatee County Park",42.0094,-91.56623,"Jim Durbin",adult,Blacklight/Fluorescent,Pinned,1,,,,,,,,,
22067,,2014-022404,SPM021805,"Costaconvexa centrostrigaria","The Bent-line Carpet",Iowa,"Van Buren",2011-06-05,,"Shimek State Forest, Farmington Unit",40.6659,-91.73637,"Jim Durbin",adult,Blacklight/Fluorescent,Photograph,1,,,,,,,,,
22068,,2014-022405,SPM021806,"Costaconvexa centrostrigaria","The Bent-line Carpet",Iowa,"Van Buren",2011-06-05,,"Shimek State Forest, Farmington Unit",40.6659,-91.73637,"Jim Durbin",adult,Blacklight/Fluorescent,Photograph,1,,,,,,,,,
22069,,2014-022406,SPM021807,"Costaconvexa centrostrigaria","The Bent-line Carpet",Iowa,"Van Buren",2011-06-05,,"Shimek State Forest, Farmington Unit",40.6659,-91.73637,"Jim Durbin",adult,Blacklight/Fluorescent,Photograph,1,,,,,,,,,
22070,,2014-022407,SPM022117,"Costaconvexa centrostrigaria","The Bent-line Carpet",Iowa,Linn,2011-06-14,,"Wickiup Hill Outdoor Learning Area",42.08398,-91.7651,"Jim Durbin",adult,Blacklight/Fluorescent,Photograph,1,,,,,,,,,
22071,"Jim Durbin Drawer 073",2014-022408,SPM022206,"Costaconvexa centrostrigaria","The Bent-line Carpet",Iowa,Linn,2011-06-20,,"Wickiup Hill Outdoor Learning Area",42.08398,-91.7651,"Jim Durbin",adult,Blacklight/Fluorescent,Pinned,1,,,,,,,,,
22072,,2014-022409,SPM022288,"Costaconvexa centrostrigaria","The Bent-line Carpet",Iowa,Linn,2011-06-20,,"Wickiup Hill Outdoor Learning Area",42.08398,-91.7651,"Jim Durbin",adult,Blacklight/Fluorescent,Photograph,1,,,,,,,,,
22073,,2014-022410,SPM022321,"Costaconvexa centrostrigaria","The Bent-line Carpet",Iowa,Linn,2011-06-20,,"Wickiup Hill Outdoor Learning Area",42.08398,-91.7651,"Jim Durbin",adult,Blacklight/Fluorescent,Photograph,1,,,,,,,,,
22074,,2014-022411,SPM022331,"Costaconvexa centrostrigaria","The Bent-line Carpet",Iowa,Linn,2011-06-20,,"Wickiup Hill Outdoor Learning Area",42.08398,-91.7651,"Jim Durbin",adult,Blacklight/Fluorescent,Photograph,1,,,,,,,,,
22075,,2014-022412,SPM022339,"Costaconvexa centrostrigaria","The Bent-line Carpet",Iowa,Linn,2011-06-20,,"Wickiup Hill Outdoor Learning Area",42.08398,-91.7651,"Jim Durbin",adult,Blacklight/Fluorescent,Photograph,1,,,,,,,,,
22076,,2014-022413,SPM022352,"Costaconvexa centrostrigaria","The Bent-line Carpet",Iowa,Linn,2011-06-20,,"Wickiup Hill Outdoor Learning Area",42.08398,-91.7651,"Jim Durbin",adult,Blacklight/Fluorescent,Photograph,1,,,,,,,,,
22077,,2014-022414,SPM022361,"Costaconvexa centrostrigaria","The Bent-line Carpet",Iowa,Linn,2011-06-20,,"Wickiup Hill Outdoor Learning Area",42.08398,-91.7651,"Jim Durbin",adult,Blacklight/Fluorescent,Photograph,1,,,,,,,,,
22078,,2014-022415,SPM022384,"Costaconvexa centrostrigaria","The Bent-line Carpet",Iowa,Linn,2011-06-20,,"Wickiup Hill Outdoor Learning Area",42.08398,-91.7651,"Jim Durbin",adult,Blacklight/Fluorescent,Photograph,1,,,,,,,,,
22079,"Jim Durbin Drawer 073",2014-022416,SPM022583,"Costaconvexa centrostrigaria","The Bent-line Carpet",Iowa,Linn,2011-06-30,,"Wanatee County Park",42.0094,-91.56623,"Jim Durbin",adult,Blacklight/Fluorescent,Pinned,1,,,,,,,,,
22080,,2014-022417,SPM022664,"Costaconvexa centrostrigaria","The Bent-line Carpet",Iowa,Linn,2011-06-30,,"Wanatee County Park",42.0094,-91.56623,"Jim Durbin",adult,Blacklight/Fluorescent,Photograph,1,,,,,,,,,
22081,,2014-022418,SPM022666,"Costaconvexa centrostrigaria","The Bent-line Carpet",Iowa,Linn,2011-06-30,,"Wanatee County Park",42.0094,-91.56623,"Jim Durbin",adult,Blacklight/Fluorescent,Photograph,1,,,,,,,,,
22082,,2014-022419,SPM022676,"Costaconvexa centrostrigaria","The Bent-line Carpet",Iowa,Linn,2011-06-30,,"Wanatee County Park",42.0094,-91.56623,"Jim Durbin",adult,Blacklight/Fluorescent,Photograph,1,,,,,,,,,
22083,,2014-022420,SPM022679,"Costaconvexa centrostrigaria","The Bent-line Carpet",Iowa,Linn,2011-06-30,,"Wanatee County Park",42.0094,-91.56623,"Jim Durbin",adult,Blacklight/Fluorescent,Photograph,1,,,,,,,,,
22084,,2014-022421,SPM022685,"Costaconvexa centrostrigaria","The Bent-line Carpet",Iowa,Linn,2011-06-30,,"Wanatee County Park",42.0094,-91.56623,"Jim Durbin",adult,Blacklight/Fluorescent,Photograph,1,,,,,,,,,
22085,,2014-022422,SPM022694,"Costaconvexa centrostrigaria","The Bent-line Carpet",Iowa,Linn,2011-06-30,,"Wanatee County Park",42.0094,-91.56623,"Jim Durbin",adult,Blacklight/Fluorescent,Photograph,1,,,,,,,,,
22086,,2014-022423,SPM023102,"Costaconvexa centrostrigaria","The Bent-line Carpet",Iowa,Linn,2011-07-16,,"Wanatee County Park",42.0094,-91.56623,"Jim Durbin",adult,Blacklight/Fluorescent,Photograph,1,,,,,,,,,
22087,,2014-022424,SPM023107,"Costaconvexa centrostrigaria","The Bent-line Carpet",Iowa,Linn,2011-07-16,,"Wanatee County Park",42.0094,-91.56623,"Jim Durbin",adult,Blacklight/Fluorescent,Photograph,1,,,,,,,,,
22088,,2014-022425,SPM023174,"Costaconvexa centrostrigaria","The Bent-line Carpet",Iowa,Linn,2011-08-06,,"Wanatee County Park",42.0094,-91.56623,"Jim Durbin",adult,Blacklight/Fluorescent,Photograph,1,,,,,,,,,