ID,"Collection / Source","Catalog Number","Specify Number",Taxon,"Common Name",State,County,Date,Time,Locale,Latitude,Longitude,Collector,"Life Stage","Collection Method","Preparation Type",Count,Temperature,Humidity,"Dew Point",Wind,"Wind Direction","Barometric Pressure",Sky,"Moon Phase",Notes
15610,,2014-015906,SPM023823,"Flatormenis proxima","Northern Flatid Planthopper",Iowa,Linn,2011-09-02,,"Wanatee County Park",42.0094,-91.56623,"Jim Durbin",adult,Blacklight/Fluorescent,Photograph,1,,,,,,,,,
15611,,2014-015907,SPM023835,"Flatormenis proxima","Northern Flatid Planthopper",Iowa,Linn,2011-09-02,,"Wanatee County Park",42.0094,-91.56623,"Jim Durbin",adult,Blacklight/Fluorescent,Photograph,1,,,,,,,,,
36266,,2014-036640,SPM024215,"Flatormenis proxima","Northern Flatid Planthopper",Iowa,Linn,2011-10-05,,"Wickiup Hill Outdoor Learning Area",42.08398,-91.7651,"Jim Durbin",adult,Blacklight/Fluorescent,Photograph,1,,,,,,,,,
36275,,2014-036649,SPM024311,"Flatormenis proxima","Northern Flatid Planthopper",Iowa,"Van Buren",2011-10-10,,"Shimek State Forest, Farmington Unit",40.6659,-91.73637,"Jim Durbin",adult,Blacklight/Fluorescent,Photograph,1,,,,,,,,,
36276,,2014-036650,SPM024312,"Flatormenis proxima","Northern Flatid Planthopper",Iowa,"Van Buren",2011-10-10,,"Shimek State Forest, Farmington Unit",40.6659,-91.73637,"Jim Durbin",adult,Blacklight/Fluorescent,Photograph,1,,,,,,,,,
36351,,2014-036725,SPM036342,"Flatormenis proxima","Northern Flatid Planthopper",Iowa,Linn,2013-08-24,,"Pinicon Ridge Park",42.21028,-91.54417,"Jim Durbin",adult,Blacklight/Fluorescent,Photograph,1,,,,,,,,,
38809,,2014-039183,SPM023841,"Flatormenis proxima","Northern Flatid Planthopper",Iowa,Linn,2011-09-02,,"Wanatee County Park",42.0094,-91.56623,"Jim Durbin",adult,Blacklight/Fluorescent,Photograph,1,,,,,,,,,
173543,,2016-038293,,"Flatormenis proxima","Northern Flatid Planthopper",Iowa,Linn,2016-08-03,2100-2330,"Hitaga Sand Ridge Prairie Preserve",42.250957,-91.632098,"Jim Durbin",adult,Blacklight/Fluorescent,Photograph,1,81,74,71,3,180,29.96,clear,Dark,
173655,,2016-038405,,"Flatormenis proxima","Northern Flatid Planthopper",Iowa,Linn,2016-08-03,2100-2330,"Hitaga Sand Ridge Prairie Preserve",42.250957,-91.632098,"Jim Durbin",adult,Blacklight/Fluorescent,Photograph,1,81,74,71,3,180,29.96,clear,Dark,
174453,,2016-039203,,"Flatormenis proxima","Northern Flatid Planthopper",Iowa,Linn,2016-08-15,2030-2300,"Hitaga Sand Ridge Prairie Preserve",42.250957,-91.632098,"Jim Durbin",adult,Blacklight/Fluorescent,Photograph,1,75,74,66,0,0,29096,cloudy,full,
175216,,2016-039966,,"Flatormenis proxima","Northern Flatid Planthopper",Iowa,Linn,2016-08-28,2000-2230,"Hitaga Sand Ridge Prairie Preserve",42.250957,-91.632098,"Jim Durbin",adult,Blacklight/Fluorescent,Photograph,1,74,83,74,9,110,30.1,cloudy,"10% visible","Rained for about 15 minutes at 8:00PM"
176170,,2016-040920,,"Flatormenis proxima","Northern Flatid Planthopper",Iowa,Linn,2016-09-05,,"Hitaga Sand Ridge Prairie Preserve",42.250957,-91.632098,"Jim Durbin",adult,Blacklight/Fluorescent,Photograph,1,81,61,71,12,190,29090,clear,"10% visible",
176222,,2016-040972,,"Flatormenis proxima","Northern Flatid Planthopper",Iowa,Linn,2016-09-05,,"Hitaga Sand Ridge Prairie Preserve",42.250957,-91.632098,"Jim Durbin",adult,Blacklight/Fluorescent,Photograph,1,81,61,71,12,190,29090,clear,"10% visible",
176336,,2016-041086,,"Flatormenis proxima","Northern Flatid Planthopper",Iowa,Linn,2016-09-05,,"Hitaga Sand Ridge Prairie Preserve",42.250957,-91.632098,"Jim Durbin",adult,Blacklight/Fluorescent,Photograph,1,81,61,71,12,190,29090,clear,"10% visible",
201548,,2017-019477,,"Flatormenis proxima","Northern Flatid Planthopper",Iowa,Jefferson,2017-07-27,,"Jefferson County Park",40.98639,-91.99111,"Moni Hayne",adult,,Photograph,1,,,,,,,,,
201564,,2017-019493,,"Flatormenis proxima","Northern Flatid Planthopper",Iowa,Jefferson,2017-07-27,,"Jefferson County Park",40.98639,-91.99111,"Moni Hayne",adult,,Photograph,1,,,,,,,,,
202101,,2018-000247,,"Flatormenis proxima","Northern Flatid Planthopper",Iowa,Linn,2011-07-26,,"Indian Creek Nature Center",41.9694444,-91.5863889,"Joe Zito",adult,,Photograph,1,,,,,,,,,
202400,,2018-000546,,"Flatormenis proxima","Northern Flatid Planthopper",Iowa,Johnson,2011-08-18,,Coralville,41.6822756,-91.5960643,"Darren McNabb",adult,,Photograph,1,,,,,,,,,
202492,,2018-000638,,"Flatormenis proxima","Northern Flatid Planthopper",Iowa,Story,2013-08-06,,"2505 Tullamore Lane, Ames",42.088653,-93.578813,"MJ Hatfield",adult,,Photograph,1,,,,,,,,,
225652,,2019-000564,,"Flatormenis proxima","Northern Flatid Planthopper",Iowa,Johnson,2018-09-08,,"Terry Trueblood Recreation Area",41.624583,-91.528054,"Mark Brown",adult,,Photograph,1,,,,,,,,,
313378,,,,"Flatormenis proxima","Northern Flatid Planthopper",Iowa,Lee,2022-08-13,20:56:44,"Shimek State Forest, Donnellson Unit",40.649547,-91.681162,"Angella Moorehouse",adult,Blacklight/Fluorescent,Photograph,1,,,,,,,,,
314459,,,,"Flatormenis proxima","Northern Flatid Planthopper",Iowa,Linn,2022-09-05,21:47:05,"Pinicon Ridge Park",42.21852221,-91.53890027,"Jim Durbin",adult,Blacklight/Fluorescent,Photograph,1,72,87,68,2,90,30.07,cloudy,"50% visible",
330975,,,,"Flatormenis proxima","Northern Flatid Planthopper",Iowa,Johnson,2022-08-06,,Redacted,Redacted,Redacted,"Mark Brown",adult,Sighting,Photograph,1,,,,,,,,,
333161,,,,"Flatormenis proxima","Northern Flatid Planthopper",Iowa,Johnson,2022-08-22,06:18:19,"MacBride Nature Recreation Area",41.78690624833333,-91.56850041333334,"Mark Brown",adult,Sighting,Photograph,1,,,,,,,,,
333190,,,,"Flatormenis proxima","Northern Flatid Planthopper",Iowa,Johnson,2022-08-20,06:18:08,"MacBride Nature Recreation Area",41.78690624833333,-91.56850041333334,"Mark Brown",adult,Sighting,Photograph,1,,,,,,,,,
340948,,,,"Flatormenis proxima","Northern Flatid Planthopper",Iowa,Linn,2023-08-25,21:43:53,"Hitaga Sand Ridge Prairie Preserve",42.25093191,-91.63218534,"Jim Durbin",adult,Blacklight/Fluorescent,Photograph,1,81,72,71,5,345,29.93,clear,"60% visible",
341403,,,,"Flatormenis proxima","Northern Flatid Planthopper",Iowa,Linn,2023-09-05,21:22:24,"Wanatee County Park",42.010077715,-91.566528441667,"Jim Durbin",adult,Blacklight/Fluorescent,Photograph,1,84,63,70,13,180,29.73,cloudy,"80% moon",
347791,,,,"Flatormenis proxima","Northern Flatid Planthopper",Iowa,Johnson,2023-08-11,06:15:34,"MacBride Nature Recreation Area",41.786695681667,-91.568396886667,"Mark Brown",adult,Sighting,Photograph,1,,,,,,,,,
348696,,,,"Flatormenis proxima","Northern Flatid Planthopper",Iowa,Johnson,2023-08-29,06:14:29,"MacBride Nature Recreation Area",41.78673574,-91.568556221667,"Mark Brown",adult,Sighting,Photograph,1,,,,,,,,,
