ID,"Collection / Source","Catalog Number","Specify Number",Taxon,"Common Name",State,County,Date,Time,Locale,Latitude,Longitude,Collector,"Life Stage","Collection Method","Preparation Type",Count,Temperature,Humidity,"Dew Point",Wind,"Wind Direction","Barometric Pressure",Sky,"Moon Phase",Notes
66809,,2014-067414,,"Loxostege munroealis","Beet Webworm Moth",Iowa,Winneshiek,2011-08-16,,"100 Acre Wood-x",0,0,"MJ Hatfield",adult,,Photograph,1,,,,,,,,,
66849,,2014-067454,,"Loxostege munroealis","Beet Webworm Moth",Iowa,Winneshiek,2012-08-14,,"100 Acre Wood-x",0,0,"MJ Hatfield",adult,,Photograph,1,,,,,,,,,
67212,,2014-067817,,"Loxostege munroealis","Beet Webworm Moth",Iowa,Winneshiek,2012-07-21,,"100 Acre Wood-x",0,0,"MJ Hatfield",adult,,Photograph,1,,,,,,,,,
67301,,2014-067906,,"Loxostege munroealis","Beet Webworm Moth",Iowa,Winneshiek,2012-07-02,,"100 Acre Wood-x",0,0,"MJ Hatfield",adult,,Photograph,1,,,,,,,,,
67311,,2014-067916,,"Loxostege munroealis","Beet Webworm Moth",Iowa,Winneshiek,2012-07-02,,"100 Acre Wood-x",0,0,"MJ Hatfield",adult,,Photograph,1,,,,,,,,,
110804,,2015-001360,,"Loxostege munroealis","Beet Webworm Moth",Iowa,Polk,2013-09-24,,Redacted,Redacted,Redacted,"Aaron Brees",adult,,Photograph,1,,,,,,,,,
120753,"Frank Olsen Drawer 17",2015-011137,,"Loxostege munroealis","Beet Webworm Moth",Iowa,Linn,2004-04-28,,"Wickiup Hill Outdoor Learning Area",42.08398,-91.7651,"Frank Olsen",adult,,Pinned,1,,,,,,,,,"Located at Iowa State"
131580,"Paul Martsching Collection",2015-022171,,"Loxostege munroealis","Beet Webworm Moth",Iowa,Story,2015-08-07,,"Ames, Paul",42.02064,-93.623952,"Paul Martsching",adult,"Building Light",Pinned,1,,,,,,,,,
133513,"Paul Martsching Collection",2015-024107,,"Loxostege munroealis","Beet Webworm Moth",Iowa,Story,2003-09-09,,"Ames, Paul",42.02064,-93.623952,"Paul Martsching",adult,"Building Light",Pinned,1,,,,,,,,,
133514,"Paul Martsching Collection",2015-024108,,"Loxostege munroealis","Beet Webworm Moth",Iowa,Story,2003-09-15,,"Ames, Paul",42.02064,-93.623952,"Paul Martsching",adult,"Building Light",Pinned,1,,,,,,,,,
168589,,2016-033334,,"Loxostege munroealis","Beet Webworm Moth",Iowa,Story,2005-08-20,,"Ames, Paul",42.02064,-93.62395,"Paul Martsching",adult,"Building Light",,1,,,,,,,,,
168590,,2016-033335,,"Loxostege munroealis","Beet Webworm Moth",Iowa,Story,2005-09-07,,"Ames, Paul",42.02064,-93.62395,"Paul Martsching",adult,"Building Light",,1,,,,,,,,,
168591,,2016-033336,,"Loxostege munroealis","Beet Webworm Moth",Iowa,Story,2006-05-22,,"Ames, Paul",42.02064,-93.62395,"Paul Martsching",adult,"Building Light",,1,,,,,,,,,
168592,,2016-033337,,"Loxostege munroealis","Beet Webworm Moth",Iowa,Story,2006-06-15,,"Ames, Paul",42.02064,-93.62395,"Paul Martsching",adult,"Building Light",,1,,,,,,,,,
168593,,2016-033338,,"Loxostege munroealis","Beet Webworm Moth",Iowa,Story,2006-07-15,,"Ames, Paul",42.02064,-93.62395,"Paul Martsching",adult,"Building Light",,1,,,,,,,,,
168594,,2016-033339,,"Loxostege munroealis","Beet Webworm Moth",Iowa,Story,2006-08-15,,"Ames, Paul",42.02064,-93.62395,"Paul Martsching",adult,"Building Light",,1,,,,,,,,,
168595,,2016-033340,,"Loxostege munroealis","Beet Webworm Moth",Iowa,Story,2006-08-31,,"Ames, Paul",42.02064,-93.62395,"Paul Martsching",adult,"Building Light",,1,,,,,,,,,
168596,,2016-033341,,"Loxostege munroealis","Beet Webworm Moth",Iowa,Story,2008-08-07,,"Ames, Paul",42.02064,-93.62395,"Paul Martsching",adult,"Building Light",,1,,,,,,,,,
168597,,2016-033342,,"Loxostege munroealis","Beet Webworm Moth",Iowa,Story,2009-07-11,,"Ames, Paul",42.02064,-93.62395,"Paul Martsching",adult,"Building Light",,1,,,,,,,,,
168598,,2016-033343,,"Loxostege munroealis","Beet Webworm Moth",Iowa,Story,2010-08-04,,"Ames, Paul",42.02064,-93.62395,"Paul Martsching",adult,"Building Light",,1,,,,,,,,,
168599,,2016-033344,,"Loxostege munroealis","Beet Webworm Moth",Iowa,Story,2010-08-06,,"Ames, Paul",42.02064,-93.62395,"Paul Martsching",adult,"Building Light",,1,,,,,,,,,
168600,,2016-033345,,"Loxostege munroealis","Beet Webworm Moth",Iowa,Story,2014-06-20,,"Ames, Paul",42.02064,-93.62395,"Paul Martsching",adult,"Building Light",,1,,,,,,,,,
168601,,2016-033346,,"Loxostege munroealis","Beet Webworm Moth",Iowa,Story,2014-09-26,,"Ames, Paul",42.02064,-93.62395,"Paul Martsching",adult,"Building Light",,1,,,,,,,,,
175551,"Paul Martsching Collection",2016-040301,,"Loxostege munroealis","Beet Webworm Moth",Iowa,Story,2016-06-07,,"Ames, Paul",42.02064,-93.623952,"Paul Martsching",adult,"Building Light",Pinned,1,,,,,,,,,
175552,"Paul Martsching Collection",2016-040302,,"Loxostege munroealis","Beet Webworm Moth",Iowa,Story,2016-06-07,,"Ames, Paul",42.02064,-93.623952,"Paul Martsching",adult,"Building Light",Pinned,1,,,,,,,,,
175553,"Paul Martsching Collection",2016-040303,,"Loxostege munroealis","Beet Webworm Moth",Iowa,Story,2016-06-07,,"Ames, Paul",42.02064,-93.623952,"Paul Martsching",adult,"Building Light",Pinned,1,,,,,,,,,
175554,"Paul Martsching Collection",2016-040304,,"Loxostege munroealis","Beet Webworm Moth",Iowa,Story,2016-06-07,,"Ames, Paul",42.02064,-93.623952,"Paul Martsching",adult,"Building Light",Pinned,1,,,,,,,,,
177610,,2016-042360,,"Loxostege munroealis","Beet Webworm Moth",Iowa,Story,2016-06-12,,"Ames, Paul",42.02064,-93.623952,"Paul Martsching",adult,"Building Light",Sighting,2,,,,,,,,,"12 June (12/13 June) hi 12th 93 deg; strong SE wind in afternoon; dew point 73 deg for more than 3 hours; mostly clear, but very hazy.  13 June 200-430 am CDST 70 deg; SE wind 7 mph; ?clear?, but hazy."
177611,,2016-042361,,"Loxostege munroealis","Beet Webworm Moth",Iowa,Story,2016-07-08,,"Ames, Paul",42.02064,-93.623952,"Paul Martsching",adult,"Building Light",Sighting,1,,,,,,,,,"08 July 2016 hi 84 deg; wind strong NW; clear.  09 July 145-330 am; 62 deg; wind N 3 mph; hazy ?clear?."
177612,,2016-042362,,"Loxostege munroealis","Beet Webworm Moth",Iowa,Story,2016-08-01,,"Ames, Paul",42.02064,-93.623952,"Paul Martsching",adult,"Building Light",Sighting,1,,,,,,,,,"01 Aug hi 78/70 wind SE ~8 mph; am overcast; pm mostly cloudy.  02 Aug 100 - 330 am; 70 > 68 deg; wind calm > SE 3 mph; mostly cloudy.  NLC fair; NGSS poor; Staples very good"
177613,,2016-042363,,"Loxostege munroealis","Beet Webworm Moth",Iowa,Story,2016-08-06,,"Ames, Paul",42.02064,-93.623952,"Paul Martsching",adult,"Building Light",Sighting,1,,,,,,,,,"06 Aug hi 81/ 60; wind NE ~5 mph; partly cloudy.  07 Aug 1245-300 am CDST; ~65 deg; calm; mostly cloudy."
177614,,2016-042364,,"Loxostege munroealis","Beet Webworm Moth",Iowa,Story,2016-08-07,,"Ames, Paul",42.02064,-93.623952,"Paul Martsching",adult,"Building Light",Sighting,1,,,,,,,,,"07 Aug hi 78/ 60; am overcast; calm; pm mostly cloudy; wind E ~ 5 mph.  08 Aug 100-200 & 330-430 am CDST; 63 deg; calm; partly cloudy.  (Meteor observing at McFarland Park between)  At Movies 12 the alcove lights were still on at 330 am; did someone forget to turn them off?  It was worth while to check all the alcoves for moths.  The best night of the season so far for number of species.   NLC good; NGSS poor; Staples good; Movies 12 good.  Enough crickets, but nothing like the next morning."
177615,,2016-042365,,"Loxostege munroealis","Beet Webworm Moth",Iowa,Story,2016-08-08,,"Ames, Paul",42.02064,-93.623952,"Paul Martsching",adult,"Building Light",Sighting,1,,,,,,,,,"08 Aug hi 78/68; wind SE ~10 mph; mostly cloudy > overcast.  09 Aug 1230-300 am temp 71/69 dew pt; wind S 3 mph; mostly cloudy.  Movie 12 alcove lights on again.  Staples & Movies 12 overrun by crickets - 20 crickets for every moth; dif?cult to ?nd medium and small moths amongst all the crickets on the walls and on the ground."
177616,,2016-042366,,"Loxostege munroealis","Beet Webworm Moth",Iowa,Story,2016-08-22,,"Ames, Paul",42.02064,-93.623952,"Paul Martsching",adult,"Building Light",Sighting,1,,,,,,,,,"22 Aug 2016 81/63 mostly clear; strong & gusty S wind.  1245-315 am CDST 23 Aug 65 deg; wind S 10 mph; 2/3 lit Moon; cirrus sky."
177617,,2016-042367,,"Loxostege munroealis","Beet Webworm Moth",Iowa,Story,2016-08-25,,"Ames, Paul",42.02064,-93.623952,"Paul Martsching",adult,"Building Light",Sighting,2,,,,,,,,,"25 Aug 2016 77/63 calm > N 5 mph; overcast till 5 pm; then partly cloudy.  1 - 3 am CDST 26 Aug 62 deg; overcast > partly cloudy; N 5 mph; 1/3 lit Moon."
177618,,2016-042368,,"Loxostege munroealis","Beet Webworm Moth",Iowa,Story,2016-08-27,,"Ames, Paul",42.02064,-93.623952,"Paul Martsching",adult,"Building Light",Sighting,3,,,,,,,,,"27 Aug 78/70calm > light & variable; fog early am; mostly cloudy; partly cloudy late pm. 1230-400 am CDST 28 Aug 62 deg; clear; calm > S ~ 5 mph; fog by 4 am; 60+ species!  Best night so far this year! ****"
177619,,2016-042369,,"Loxostege munroealis","Beet Webworm Moth",Iowa,Story,2016-08-28,,"Ames, Paul",42.02064,-93.623952,"Paul Martsching",adult,"Building Light",Sighting,1,,,,,,,,,"28 Aug 87/75 calm > S ~7 mph; fog early am; mostly cloudy.  29 Aug 230-400 am CDST 70 deg; calm; clear; fog by 4 am.  Very good night!! ***"
177620,,2016-042370,,"Loxostege munroealis","Beet Webworm Moth",Iowa,Story,2016-08-29,,"Ames, Paul",42.02064,-93.623952,"Paul Martsching",adult,"Building Light",Sighting,1,,,,,,,,,"29 Aug  84/76 fog early am; mostly cloudy; variable wind; 5 pm thunderstorm."
182923,,2017-000884,,"Loxostege munroealis","Beet Webworm Moth",Iowa,Allamakee,2016-08-13,,Redacted,Redacted,Redacted,"MJ Hatfield",adult,,Photograph,1,,,,,,,,,
225912,,2019-000632,,"Loxostege munroealis","Beet Webworm Moth",Iowa,Story,2018-08-07,,"Ames, Paul",42.02064,-93.623952,"Paul Martsching",adult,"Building Light",Sighting,1,,,,,,,,,
225913,,2019-000633,,"Loxostege munroealis","Beet Webworm Moth",Iowa,Story,2018-08-08,,"Ames, Paul",42.02064,-93.623952,"Paul Martsching",adult,"Building Light",Sighting,1,,,,,,,,,
225914,,2019-000634,,"Loxostege munroealis","Beet Webworm Moth",Iowa,Story,2018-08-28,,"Ames, Paul",42.02064,-93.623952,"Paul Martsching",adult,"Building Light",Sighting,1,,,,,,,,,
242106,,,,"Loxostege munroealis","Beet Webworm Moth",Iowa,Story,2019-09-02,330,"Ames, Paul",42.02064,-93.623952,"Paul Martsching",adult,"Building Light",Sighting,1,,,,,,,,,
242107,,,,"Loxostege munroealis","Beet Webworm Moth",Iowa,Story,2019-09-26,330,"Ames, Paul",42.02064,-93.623952,"Paul Martsching",adult,"Building Light",Sighting,1,,,,,,,,,
343718,,,,"Loxostege munroealis","Beet Webworm Moth",Iowa,Johnson,2023-07-16,,"MacBride Nature Recreation Area",41.786966,-91.568593,"Mark Brown",adult,Sighting,Photograph,1,,,,,,,,,
345324,,,,"Loxostege munroealis","Beet Webworm Moth",Iowa,Johnson,2023-07-23,06:11:20,"MacBride Nature Recreation Area",41.786887861667,-91.56850911,"Mark Brown",adult,Sighting,Photograph,1,,,,,,,,,
