ID,"Collection / Source","Catalog Number","Specify Number",Taxon,"Common Name",State,County,Date,Time,Locale,Latitude,Longitude,Collector,"Life Stage","Collection Method","Preparation Type",Count,Temperature,Humidity,"Dew Point",Wind,"Wind Direction","Barometric Pressure",Sky,"Moon Phase",Notes
26386,"Jim Durbin Drawer 012",2014-026734,SPM027001,"Olethreutes monetiferanum",None,Iowa,Jones,2012-05-12,,"Westphal Timber, Jones",42.1349,-90.95348,"Jim Durbin",adult,Blacklight/Fluorescent,Pinned,1,,,,,,,,,
26387,"Jim Durbin Drawer 012",2014-026735,SPM027005,"Olethreutes monetiferanum",None,Iowa,Jones,2012-05-12,,"Westphal Timber, Jones",42.1349,-90.95348,"Jim Durbin",adult,Blacklight/Fluorescent,Pinned,1,,,,,,,,,
26388,"Jim Durbin Drawer 012",2014-026736,SPM027006,"Olethreutes monetiferanum",None,Iowa,Jones,2012-05-12,,"Westphal Timber, Jones",42.1349,-90.95348,"Jim Durbin",adult,Blacklight/Fluorescent,Pinned,1,,,,,,,,,
26389,"Jim Durbin Drawer 012",2014-026737,SPM027015,"Olethreutes monetiferanum",None,Iowa,Jones,2012-05-12,,"Westphal Timber, Jones",42.1349,-90.95348,"Jim Durbin",adult,Blacklight/Fluorescent,Pinned,1,,,,,,,,,
26390,,2014-026738,SPM027035,"Olethreutes monetiferanum",None,Iowa,Jones,2012-05-12,,"Westphal Timber, Jones",42.1349,-90.95348,"Jim Durbin",adult,Blacklight/Fluorescent,Photograph,1,,,,,,,,,
26391,,2014-026739,SPM027081,"Olethreutes monetiferanum",None,Iowa,Jones,2012-05-12,,"Westphal Timber, Jones",42.1349,-90.95348,"Jim Durbin",adult,Blacklight/Fluorescent,Photograph,1,,,,,,,,,
26392,,2014-026740,SPM027093,"Olethreutes monetiferanum",None,Iowa,Jones,2012-05-12,,"Westphal Timber, Jones",42.1349,-90.95348,"Jim Durbin",adult,Blacklight/Fluorescent,Photograph,1,,,,,,,,,
38525,"Jim Durbin Drawer 012",2014-038899,SPM034004,"Olethreutes monetiferanum",None,Iowa,Linn,2013-06-18,,"Matsell Bridge Natural Area",42.13131,-91.38886,"Jim Durbin",adult,Blacklight/Fluorescent,Pinned,1,,,,,,,,,
41116,,2014-041493,SPM036495,"Olethreutes monetiferanum",None,Iowa,Dubuque,2013-06-01,,"Catfish Creek State Preserve",42.4679,-90.6553,"Frank Olsen",adult,,Pinned,1,,,,,,,,,"Located at Iowa State"
129690,,2015-020280,,"Olethreutes monetiferanum",None,Iowa,Winneshiek,2007-05-19,,"Plymouth Rock-x",0,0,"MJ Hatfield",adult,,Photograph,1,,,,,,,,,
132894,"Frank Olsen Drawer 49",2015-023488,,"Olethreutes monetiferanum",None,Iowa,Linn,2015-06-03,,"Matsell Bridge Natural Area",42.131959,-91.388307,"Frank Olsen",adult,,Pinned,1,,,,,,,,,"Located at Iowa State"
135409,,2015-026003,,"Olethreutes monetiferanum",None,Iowa,Clayton,2010-05-24,,"Osborne Outdoor Education Center Park",42.79303,-91.4432,"Frank Olsen",adult,,Pinned,1,,,,,,,,,"Located at Iowa State"
182628,,2017-000589,,"Olethreutes monetiferanum",None,Iowa,Winneshiek,2016-06-12,,"100 Acre Wood-x",0,0,"MJ Hatfield",adult,,Photograph,1,,,,,,,,,
182638,,2017-000599,,"Olethreutes monetiferanum",None,Iowa,Winneshiek,2016-06-12,,"100 Acre Wood-x",0,0,"MJ Hatfield",adult,,Photograph,1,,,,,,,,,
211366,,2018-009523,,"Olethreutes monetiferanum",None,Iowa,Linn,2018-05-30,"2045 - 2315","Hitaga Sand Ridge Prairie Preserve",42.25095,-91.63209,"Jim Durbin",adult,Blacklight/Fluorescent,Photograph,1,77,56,60,7,270,29.59,"partly cloudy",full,
215270,,2018-013426,,"Olethreutes monetiferanum",None,Iowa,Winneshiek,2018-05-29,,"100 Acre Wood-x",0,0,"MJ Hatfield",adult,"Blacklight Trap",Photograph,1,,,,,,,,,
265603,,,,"Olethreutes monetiferanum",None,Iowa,Linn,2020-06-05,22:21:10,"Hitaga Sand Ridge Prairie Preserve",42.25088607,-91.63212362,"Jim Durbin",adult,Blacklight/Fluorescent,Photograph,1,75,58,59,4,355,29.95,clear,Full,
266758,,,,"Olethreutes monetiferanum",None,Iowa,Linn,2020-06-12,22:10:46,"Hitaga Sand Ridge Prairie Preserve",42.2508675,-91.63209427,"Jim Durbin",adult,Blacklight/Fluorescent,Photograph,1,76,48,55,0,0,30.17,"partly cloudy","80% visible",
288194,,,,"Olethreutes monetiferanum",None,Iowa,Linn,2021-06-02,22:19:51,"Hitaga Sand Ridge Prairie Preserve",42.25092585,-91.63217796,"Jim Durbin",adult,Blacklight/Fluorescent,Photograph,1,65,69,55,,,29.91,clear,"6% visible",
288223,,,,"Olethreutes monetiferanum",None,Iowa,Linn,2021-06-02,21:11:31,"Hitaga Sand Ridge Prairie Preserve",42.25092585,-91.63217796,"Jim Durbin",adult,Blacklight/Fluorescent,Photograph,1,65,69,55,,,29.91,clear,"6% visible",
309958,,,,"Olethreutes monetiferanum",None,Iowa,Linn,2022-06-09,20:39:08,"Matsell Bridge Natural Area",42.1322708,-91.38538363,"Jim Durbin",adult,Blacklight/Fluorescent,Photograph,1,68,59,53,0,0,29.95,cloudy,"60% visible",
309972,,,,"Olethreutes monetiferanum",None,Iowa,Linn,2022-06-09,20:33:53,"Matsell Bridge Natural Area",42.1322708,-91.38538363,"Jim Durbin",adult,Blacklight/Fluorescent,Photograph,1,68,59,53,0,0,29.95,cloudy,"60% visible",
357014,,,,"Olethreutes monetiferanum",None,Iowa,Winneshiek,2018-06-06,,"Lionberger Environmental Preserve",43.334148,-91.871215,"Lena Schmitt",adult,,,1,,,,,,,,,"Data from Kirk Larsen, Luther College"
